program: Gaussian 09
title: 000201007
version: EM64L-G09RevD.01
frameworkgroup: C1[X(C18H27N)]
method: RPBEPBE
basis: SDD
operation: Freq
keyword: #pfreq=noraman
keyword: PBEPBE/SDD
title: #p freq=noraman PBEPBE/SDD
converged: NO YES NO NO
title: Mulliken charges:
elementType: N C C C C C C C C C C C C C C C C C C H H H H H H H H H H H H H H H H H H H H H H H H H H H
charge: -0.075716 0.315249 -0.481736 -0.471088 -0.491556 -0.441028 -0.425419 -0.381748 0.413288 -0.434436 -0.405867 -0.414587 -0.412616 -0.394309 -0.403388 -0.372239 -0.256760 -0.273413 -0.247431 0.225478 0.194597 0.217323 0.186118 0.207544 0.212524 0.194391 0.199688 0.195781 0.196419 0.198384 0.188730 0.217074 0.247398 0.197739 0.209057 0.204670 0.205976 0.208587 0.199635 0.209662 0.202310 0.249801 0.220173 0.220285 0.220606 0.224850
chargesum: 0.00000
title: Mulliken charges with hydrogens summed into heavy atoms:
elementType: N C C C C C C C C C C C C C C C C C C
charge: -0.075716 0.315249 -0.061661 -0.067647 -0.071489 -0.046950 -0.033219 0.005367 0.413288 0.030036 0.000929 -0.003940 -0.004395 0.017663 -0.153586 -0.152066 -0.036474 -0.052807 -0.022580
polarizability: 1.86052230e+02 2.10682654e+01 2.09222478e+02 3.58168756e-01 -1.17765502e+00 1.73941313e+02
1716.lowfreq: -20.8830 -8.2526 -0.0007 0.0003 0.0004 12.4507 13.2569 44.0322 47.2024
frequency: -14.8883 43.9971 47.1597 56.8943 82.3564 104.4216 146.6388 159.3055 183.4843 224.2120 244.5796 258.5273 281.8568 289.4606 347.5633 356.0049 393.7326 401.4513 405.6751 431.7556 438.6790 472.8410 488.3432 505.6763 551.3922 606.6030 617.6035 624.2689 697.4706 703.6823 750.0006 768.0577 780.5682 781.8849 805.7697 823.2614 832.8669 846.5420 849.1280 856.6233 872.4985 901.0414 922.5312 927.9077 936.0118 949.0919 960.6385 971.8078 974.5689 989.8124 990.5334 1011.8995 1015.8187 1034.2827 1060.5470 1069.4164 1073.0087 1083.3730 1088.5609 1100.2901 1105.9697 1134.1257 1151.3647 1154.3214 1161.9505 1171.8271 1190.5460 1196.5712 1198.6952 1216.4040 1235.3369 1251.1484 1260.0563 1276.6482 1280.0579 1303.4953 1309.6856 1316.0131 1318.3344 1324.3899 1328.0901 1335.0842 1338.4606 1342.6223 1344.2716 1345.4915 1351.9335 1360.6044 1366.7036 1376.4416 1432.2998 1452.4526 1455.0087 1457.6902 1464.8549 1468.2898 1469.8368 1473.0896 1475.7658 1477.5848 1484.2043 1485.6249 1492.6129 1585.5374 1609.6039 2913.7580 2938.3725 2962.5332 2963.3791 2965.8796 2970.3104 2971.9885 2973.0011 2978.4244 2981.4766 2988.0029 3016.1331 3018.3765 3022.5017 3026.1830 3027.2079 3029.6489 3034.0715 3040.7948 3043.9719 3051.2829 3079.8738 3114.3130 3123.1203 3136.2770 3153.9204 3168.8556
redmass: 3.4189 3.3937 3.7731 3.0584 3.3081 2.4205 3.0594 2.9229 2.8260 2.9116 2.0242 2.0320 2.1004 4.8693 2.4001 2.0368 2.1826 2.8813 2.8501 2.5180 3.0855 2.5146 1.7968 3.5828 2.6489 3.1974 6.2388 2.4091 3.8523 1.5976 1.4091 1.9565 1.5775 2.0493 2.1236 2.4533 2.4144 1.4452 1.4780 2.1627 2.7652 1.6715 1.8558 1.5866 1.6835 1.9319 2.2203 1.4047 2.0040 4.9923 1.3643 2.8246 2.2549 2.0961 1.8975 2.2457 1.7557 1.7864 1.4304 1.7593 2.1710 1.7495 1.4525 2.2513 1.6953 1.0615 1.8374 1.6388 1.1638 1.7209 1.3172 1.1779 1.4557 1.2624 1.3290 1.3050 1.3633 1.3367 1.2616 1.3320 1.3325 1.3411 1.3664 1.4974 1.4305 1.4953 1.4640 1.3877 1.4716 4.3153 2.2436 1.0859 1.0941 1.0956 1.0771 1.0851 1.0862 1.0859 1.0891 1.0931 1.3235 1.5062 1.0988 5.8301 6.0036 1.0680 1.0674 1.0615 1.0616 1.0612 1.0642 1.0625 1.0596 1.0667 1.0612 1.0686 1.0958 1.0976 1.0947 1.1003 1.0977 1.0937 1.0984 1.1020 1.0991 1.1022 1.0977 1.0845 1.0874 1.0936 1.0973 1.0961
irintensity: 0.1789 0.0694 0.0376 0.1079 0.0473 0.4771 0.1034 1.0342 2.1269 0.0996 0.2214 0.0945 0.6409 0.2724 1.6042 1.0876 1.4242 2.4738 1.8820 0.4164 1.3174 0.2317 0.9854 3.9350 8.6110 11.8769 0.2271 7.2338 1.1984 70.7176 4.9587 13.5862 3.8700 16.4536 6.5828 9.1467 3.5294 0.6648 2.3491 14.4337 4.9202 0.5242 1.0100 6.7627 1.0886 2.0746 8.5002 0.9742 10.2777 0.3081 0.0743 21.4882 4.7217 3.2585 2.0703 79.2472 7.9869 2.4514 5.8613 2.4242 3.1826 0.4792 10.6906 1.2967 9.1970 0.0224 6.1096 8.5092 1.2754 2.8540 0.9883 2.6167 0.4761 2.2322 0.8922 7.3214 9.7208 0.3260 2.9592 4.0820 4.2170 8.6640 1.9873 3.4861 2.4320 4.7103 10.6940 9.3200 0.5392 0.3133 6.3563 3.6924 6.6371 9.8640 1.8980 12.8076 15.7191 10.0864 11.6007 3.9789 2.0318 24.6447 10.9052 2.0765 13.7620 42.7402 61.8982 35.9126 14.9696 51.5075 33.1162 29.1624 19.4212 35.8409 73.8567 31.8786 15.5136 63.7673 108.6843 9.9265 22.4087 24.3804 9.8138 79.6006 101.0929 113.6038 26.9039 6.2333 1.9673 37.7492 40.6069 10.8131
temp: 298.150 k
press: 1.00000 atm
elementType: 7 6 6 6 6 6 6 6 6 6 6 6 6 6 6 6 6 6 6 1 1 1 1 1 1 1 1 1 1 1 1 1 1 1 1 1 1 1 1 1 1 1 1 1 1 1
symmnumber: 1
zpe: 1077947.4 jmol-1
zpe.correction: 0.410568 hartree
zpe.thermalcorrener: 0.427417 hartree
zpe.thermalcorrenthalpy: 0.428362 hartree
zpe.thermalcorrgfe: 0.366421 hartree
zpe.sumelectzpe: -755.377876 hartree
zpe.sumelectthermal: -755.361027 hartree
zpe.sumelectthermalent: -755.360083 hartree
zpe.sumelectthermalfe: -755.422024 hartree
dipole: 1.0575 0.1714 0.4959
dipole: 1.1806
quadrupole: -117.0095 -113.7615 -113.5614
quadrupole: 1.8603 0.3548 0.1736
quadrupole: -2.2320 1.0160 1.2161 1.8603 0.3548 0.1736
hfenergy: -755.7884447 hartree
pointgroup: C01 [X(C18H27N1)]
dipole: -0.2407429 -0.3399425 0.2054617 debye
polarizability: 177.2096144|-12.6677793|218.0543971|-0.5404593|-1.4200808|173.9520086 unknown
InChI: InChI=1S/C18H27N/c1-4-10-17(11-5-1)18(12-6-2-7-13-18)16-19-14-8-3-9-15-19/h1,4-5,10-11H,2-3,6-9,12-16H2
charge 0 multiplicity 1
46 atoms
N  -1.192994 -0.960064 -0.544883
C  1.136554 -0.073821 0.101852
C  1.740256 -0.683704 -1.195643
C  2.183171 -0.192446 1.265701
C  -0.170646 -0.864403 0.513152
C  2.344864 -2.095084 -1.011417
C  2.805291 -1.601215 1.432348
C  3.409321 -2.11759 0.108001
C  0.762698 1.414157 -0.093264
C  -2.311703 0.006768 -0.467171
C  -1.669917 -2.311748 -0.940573
C  -3.336574 -0.344926 0.665549
C  -3.090712 -2.653075 -0.37398
C  -3.331946 -1.875563 0.940329
C  0.708832 2.030228 -1.371482
C  0.409597 2.213997 1.030605
C  0.325152 3.383262 -1.521804
C  0.025611 3.564318 0.8880
C  -0.019043 4.160289 -0.39402
H  0.946255 -0.720375 -1.96538
H  2.54066 -0.011278 -1.568195
H  2.996099 0.535802 1.068669
H  1.718849 0.110639 2.225216
H  -0.577636 -0.379909 1.429957
H  0.128334 -1.886445 0.812821
H  2.789398 -2.426596 -1.970286
H  1.545737 -2.826067 -0.7714
H  2.039667 -2.320871 1.78752
H  3.581931 -1.560312 2.221261
H  3.814693 -3.139702 0.240737
H  4.260479 -1.467683 -0.184443
H  -2.827025 -0.002369 -1.447927
H  -1.910608 1.024185 -0.33095
H  -0.934662 -3.05444 -0.577342
H  -1.687192 -2.39555 -2.048244
H  -4.347612 -0.015908 0.353341
H  -3.097716 0.204954 1.596072
H  -3.180211 -3.744548 -0.215002
H  -3.872691 -2.373072 -1.107693
H  -2.521897 -2.123727 1.654736
H  -4.280871 -2.18642 1.416471
H  0.958811 1.453744 -2.266209
H  0.431492 1.779892 2.037094
H  0.292318 3.827805 -2.523593
H  -0.238693 4.151097 1.775691
H  -0.31682 5.208573 -0.509824
