program: Gaussian 09
title: 000201000
version: EM64L-G09RevD.01
frameworkgroup: C1[X(C12H20NO6PS)]
method: RPBEPBE
basis: SDD
operation: Freq
keyword: #p
keyword: freq=noraman
keyword: PBEPBE/SDD
title: #p freq=noraman PBEPBE/SDD
converged: YES YES NO NO
title: Mulliken charges:
elementType: S P O O O O O O N C C C C C C C C C C C C H H H H H H H H H H H H H H H H H H H H
charge: 0.929270 1.399852 -0.536469 -0.533515 -0.556611 -0.490262 -0.501321 -0.593547 -0.318022 -0.340996 -0.341536 -0.052254 -0.656351 -0.655470 -0.210992 -0.241452 -0.328728 -0.358086 0.394542 -0.477193 -0.484763 0.218048 0.259260 0.232169 0.233709 0.214201 0.258395 0.224503 0.210951 0.210895 0.263892 0.279886 0.299940 0.303446 0.265028 0.240155 0.254848 0.246227 0.246389 0.236931 0.255031
chargesum: 0.00000
title: Mulliken charges with hydrogens summed into heavy atoms:
elementType: S P O O O O O O N C C C C C C C C C C C C
charge: 0.929270 1.399852 -0.536469 -0.533515 -0.556611 -0.490262 -0.501321 -0.593547 -0.318022 0.136312 0.124341 -0.052254 0.040748 0.030268 0.068893 0.058488 -0.025282 -0.093059 0.394542 0.264038 0.253588
polarizability: 2.87739265e+02 6.83059478e+00 1.68001712e+02 -9.06294615e+00 -7.97595394e+00 1.85307487e+02
1716.lowfreq: -15.7006 -14.2020 -13.2892 -2.5718 0.0012 0.0016 0.0017 9.0340 28.5633
frequency: -12.4128 -11.9176 27.1876 37.6834 41.8287 52.5064 60.6878 64.6397 67.5681 88.2254 103.1484 113.6680 116.6260 138.0968 149.7403 157.4431 178.0415 183.7005 214.7056 216.3352 224.3203 247.8263 255.4623 277.2900 280.5205 290.7559 318.0084 343.7968 355.3529 371.6092 392.4951 402.1717 412.2379 431.7463 444.6655 471.0785 517.8336 556.6607 579.2702 601.6205 618.0092 693.2189 699.6508 717.0839 737.4128 756.9409 793.8546 817.8093 829.6818 833.6669 851.3200 900.1773 925.7738 954.1027 961.0796 962.6760 978.2250 991.9530 1003.8130 1050.1382 1055.2979 1063.3185 1072.5531 1083.5549 1108.2344 1112.2668 1112.6346 1128.3769 1130.9313 1159.4098 1170.2711 1179.5060 1193.6662 1274.1151 1289.0482 1300.6101 1346.7156 1352.4926 1382.5250 1383.0349 1392.4237 1400.1774 1423.3180 1426.5941 1438.9737 1449.8542 1456.2434 1456.5187 1464.9448 1468.5088 1470.6786 1472.5348 1473.0244 1484.3511 1492.4619 1584.1955 1598.0326 2975.1514 2987.4191 2991.6678 2994.0031 2994.8886 2999.5159 3028.6756 3061.3803 3079.3079 3083.9927 3099.5447 3106.1321 3110.1827 3114.7060 3137.1779 3142.0175 3154.3952 3156.6324 3173.3485 3180.2440
redmass: 4.0773 3.4699 3.8537 3.4656 3.5987 1.4561 3.2814 2.2905 2.3267 3.3930 2.5724 5.7009 1.2174 4.0401 4.6349 4.8651 4.6601 2.1010 6.4292 5.4804 2.9159 2.7099 1.9547 2.3347 7.4487 3.5396 6.0986 7.6619 4.0060 6.4697 3.4768 4.7688 2.9767 5.7001 6.4910 5.6428 3.3408 5.4811 4.8631 8.5829 7.3532 9.7136 9.5605 3.9006 1.8726 1.2247 13.7389 1.5871 1.6845 3.0576 1.5187 2.2291 14.3808 10.2099 1.8419 3.6512 1.3505 5.2928 3.0893 2.5180 1.9619 11.0381 1.7396 1.7810 1.2975 1.2363 1.2403 1.2829 1.2984 1.8325 1.5030 3.0734 2.3622 1.2423 1.2612 1.1492 1.1942 1.1813 2.6265 1.7362 1.1923 3.3926 1.1236 1.1195 1.0747 1.0737 1.0576 1.0531 2.1552 1.0453 1.0537 1.0461 1.0671 1.0472 1.0498 6.1000 7.9929 1.0602 1.0370 1.0414 1.0294 1.0586 1.0289 1.1009 1.0997 1.0981 1.0978 1.1058 1.1020 1.1053 1.1002 1.1043 1.1053 1.0899 1.0897 1.0972 1.0964
irintensity: 0.1439 1.5468 0.5997 1.9305 1.9880 0.8888 0.2415 5.3736 2.2570 2.0220 0.4978 7.3491 0.7836 1.8545 0.8297 3.0060 7.5403 2.4924 0.3350 0.8500 3.5120 15.4833 1.2909 8.7805 45.7973 9.0984 2.5807 11.7324 0.5074 12.6478 11.4665 26.7595 0.9786 20.3833 8.5240 86.6309 51.4549 11.3163 124.8975 151.3667 5.1612 115.6639 148.5214 3.0478 37.5632 6.5712 66.8521 0.2744 86.8933 221.5597 60.9169 6.1276 74.2661 191.6272 59.6798 156.9725 0.5719 8.8111 38.6880 41.6030 2.6396 115.5215 6.9066 7.1205 15.3796 0.2805 1.2089 2.0739 0.4004 2.1589 188.7974 49.1667 180.6838 16.2226 5.7153 15.4879 2.6183 8.2064 10.5694 10.3445 44.4123 12.9326 3.2390 3.2478 11.2433 7.0905 5.2055 9.2325 155.8855 5.0406 23.4154 15.6614 3.5140 8.0106 12.1351 89.4749 10.5281 20.5283 27.1320 32.0536 43.4384 26.5108 35.6511 10.1218 3.9142 55.8536 17.1420 24.2832 13.8088 21.6857 26.1449 9.1499 13.2335 3.6462 0.6221 0.5480 5.4086
temp: 298.150 k
press: 1.00000 atm
elementType: 16 15 8 8 8 8 8 8 7 6 6 6 6 6 6 6 6 6 6 6 6 1 1 1 1 1 1 1 1 1 1 1 1 1 1 1 1 1 1 1 1
symmnumber: 1
zpe: 821146.2 jmol-1
zpe.correction: 0.312758 hartree
zpe.thermalcorrener: 0.337127 hartree
zpe.thermalcorrenthalpy: 0.338071 hartree
zpe.thermalcorrgfe: 0.257317 hartree
zpe.sumelectzpe: -1712.800105 hartree
zpe.sumelectthermal: -1712.775736 hartree
zpe.sumelectthermalent: -1712.774792 hartree
zpe.sumelectthermalfe: -1712.855546 hartree
dipole: -3.5698 5.6911 3.8779
dipole: 7.7569
quadrupole: -131.2710 -136.6413 -145.0677
quadrupole: 14.0880 -17.4515 -4.1363
quadrupole: 6.3890 1.0187 -7.4077 14.0880 -17.4515 -4.1363
hfenergy: -1713.1128626 hartree
pointgroup: C01 [X(C12H20N1O6P1S1)]
dipole: 1.4068099 -1.3569838 2.3437293 debye
polarizability: 284.7874926|17.8958676|178.5497797|9.8997155|13.0461499|177.7111917 unknown
InChI: InChI=1S/C12H20NO6PS/c1-5-13(6-2)21(15,16)12-9-7-11(8-10-12)19-20(14,17-3)18-4/h7-10H,5-6H2,1-4H3
charge 0 multiplicity 1
41 atoms
S  -2.995533 0.3519 -0.56801
P  4.234998 -0.163575 -0.138557
O  -3.66114 1.458727 0.442205
O  -3.331353 0.385848 -2.161925
O  2.983733 1.010529 0.160348
O  5.590433 0.867898 -0.083243
O  4.171958 -1.001322 1.373722
O  4.161188 -1.063353 -1.43813
N  -3.293445 -1.419907 -0.058036
C  -4.443546 -2.027628 -0.790794
C  -3.123096 -1.644595 1.404079
C  -1.130273 0.475001 -0.322132
C  -5.833158 -1.358472 -0.665284
C  -4.258889 -1.22688 2.368254
C  -0.286848 -0.21367 -1.209209
C  -0.658694 1.316156 0.699047
C  1.10869 -0.069304 -1.059332
C  0.736298 1.453843 0.855226
C  1.600067 0.760222 -0.020963
C  5.768161 1.822434 1.044641
C  4.663251 -2.405097 1.418193
H  -4.4777 -3.074534 -0.428831
H  -4.159091 -2.057284 -1.857089
H  -2.184585 -1.134489 1.69654
H  -2.922052 -2.730549 1.501139
H  -6.562739 -1.92745 -1.271397
H  -5.80147 -0.328834 -1.061703
H  -6.19898 -1.322974 0.373097
H  -3.921598 -1.37983 3.410796
H  -5.16866 -1.833452 2.220029
H  -4.511373 -0.161253 2.236367
H  -0.703989 -0.833207 -2.008552
H  -1.368419 1.853822 1.336376
H  1.799578 -0.580333 -1.737142
H  1.162574 2.090227 1.635239
H  5.737951 1.291258 2.012034
H  4.988368 2.600123 1.005384
H  6.763251 2.257059 0.87211
H  4.319834 -2.782414 2.392325
H  5.765584 -2.431706 1.363121
H  4.228416 -2.99823 0.595559
