program: Gaussian 09
title: 000200981
version: EM64L-G09RevD.01
frameworkgroup: C1[X(C11H11N)]
method: RPBEPBE
basis: SDD
operation: Freq
keyword: #pfreq=noraman
keyword: PBEPBE/SDD
title: #p freq=noraman PBEPBE/SDD
converged: NO YES NO NO
title: Mulliken charges:
elementType: N C C C C C C C C C C C H H H H H H H H H H H
charge: -0.478373 0.275530 0.354522 0.341482 -0.384038 -0.403116 -0.389672 -0.391237 -0.806929 -0.233434 -0.240546 -0.251151 0.306956 0.239392 0.245711 0.230590 0.201579 0.230033 0.248812 0.231034 0.223074 0.221984 0.227794
chargesum: 0.00000
title: Mulliken charges with hydrogens summed into heavy atoms:
elementType: N C C C C C C C C C C C
charge: -0.171417 0.275530 0.354522 0.341482 -0.144646 -0.157405 -0.159082 -0.189658 -0.097049 -0.010359 -0.018561 -0.023357
polarizability: 2.15495520e+02 -4.64947157e+00 1.25263046e+02 1.79964402e+00 1.13863288e+00 5.67436187e+01
1716.lowfreq: -8.7261 0.0004 0.0004 0.0004 3.3363 8.6638 41.5253 89.6575 100.9876
frequency: 41.4131 89.6423 100.9795 120.0464 211.1504 280.2484 307.4023 341.5508 402.0435 444.5954 503.7941 573.5236 614.3928 621.8032 635.3667 658.3399 686.2831 694.9632 763.5264 781.2147 836.8657 851.5313 903.5496 919.2811 967.3708 973.5662 982.9684 986.8573 988.2553 1023.9592 1041.6161 1053.9002 1066.0037 1082.8671 1171.8619 1193.7814 1223.7581 1265.4704 1310.5886 1324.7127 1364.2518 1390.9106 1402.1379 1408.2879 1443.0123 1467.2969 1468.3577 1480.8149 1527.5809 1576.0298 1592.0137 1618.5856 2964.8109 3033.2111 3096.4790 3110.4248 3125.4488 3137.6334 3149.2099 3165.3456 3206.8617 3227.4174 3598.6818
redmass: 3.2835 1.7502 1.6113 3.7722 3.4700 3.4093 4.0104 4.8268 2.8059 3.5506 3.2322 1.2510 6.1912 3.0774 4.8635 2.9713 5.1798 1.8697 1.4786 1.5185 1.2748 1.3858 1.4844 5.6636 1.4144 1.5338 4.5029 4.0529 1.3293 2.4219 1.4514 1.2826 2.1757 1.6340 1.0537 1.1305 1.7805 1.5430 1.5612 3.6019 2.7596 5.1717 1.7027 2.0233 2.5258 2.5325 1.0464 1.1983 5.3440 5.2605 4.6645 5.8397 1.0392 1.0982 1.0952 1.0867 1.0856 1.0917 1.0952 1.1014 1.0924 1.1037 1.0800
irintensity: 1.4165 0.4004 0.1946 0.6565 0.8398 0.8663 0.4511 0.4208 0.0626 0.6800 7.6048 52.1118 0.5145 7.1466 7.6288 1.0064 1.2337 39.7766 162.6202 24.3158 0.1840 0.1871 5.9950 4.4404 0.1236 0.6367 3.6017 0.7437 0.3329 5.5527 5.6351 30.3371 7.6095 12.2731 0.2743 1.4249 33.5806 41.0923 0.2321 4.5305 2.6107 7.5450 0.7953 2.8144 6.9188 13.1832 15.5174 1.9113 109.8797 6.6282 14.2327 68.2768 71.9159 27.0500 13.6382 17.7434 1.8833 20.4398 38.4093 23.4202 9.9296 3.9527 29.3937
temp: 298.150 k
press: 1.00000 atm
elementType: 7 6 6 6 6 6 6 6 6 6 6 6 1 1 1 1 1 1 1 1 1 1 1
symmnumber: 1
zpe: 494032.9 jmol-1
zpe.correction: 0.188167 hartree
zpe.thermalcorrener: 0.198498 hartree
zpe.thermalcorrenthalpy: 0.199442 hartree
zpe.thermalcorrgfe: 0.151568 hartree
zpe.sumelectzpe: -479.683931 hartree
zpe.sumelectthermal: -479.673600 hartree
zpe.sumelectthermalent: -479.672656 hartree
zpe.sumelectthermalfe: -479.720530 hartree
dipole: -0.8214 -1.7237 0.3457
dipole: 1.9405
quadrupole: -61.0798 -61.2138 -77.3965
quadrupole: 3.6053 -0.2460 -0.1820
quadrupole: 5.4836 5.3496 -10.8331 3.6053 -0.2460 -0.1820
hfenergy: -479.8720978 hartree
pointgroup: C01[X(C11H11N1)]
dipole: 0.3056623 -0.6846967 -0.1435104 debye
dipolederiv: -0.0089375 -0.1096397 -0.0059958 -0.1466641 -0.5595513 -0.0350444 0.0802819 0.0087049 -0.2256974 -0.5814493 -0.0714917 -0.0223645 -0.2087359 0.2322432 0.0586688 -0.0919624 0.0027942 -0.0271522 1.0710534 0.1335458 0.0167704 0.1599901 -0.0146513 -0.0086216 0.0422224 0.0142434 0.0628229 -0.1139043 0.1020283 0.0149867 -0.3638087 0.3254007 0.0563628 -0.0787877 0.0578357 -0.0515903 0.3081209 0.0102979 -0.0036957 0.0733647 -0.0682831 0.0369401 -0.048374 0.0339913 -0.2250635 -0.3156552 0.0154448 0.0048116 0.4081137 -0.0985605 0.0225454 0.1007694 0.0257346 -0.2631474 -0.4164026 -0.0097891 -0.0099235 0.2271691 0.057999 -0.0371556 -0.0172778 -0.0276679 -0.1651463 -0.2849226 -0.0422878 0.0252601 -0.3315681 -0.0184696 -0.0503246 0.0307349 -0.0462025 -0.1866855 0.0505078 -0.0251791 -0.0035812 0.0730954 0.0427386 -0.0138759 0.0006545 -0.0146762 0.1237671 0.1946036 -0.0312453 0.0157718 -0.0502294 0.1115743 -0.0369755 0.0360605 -0.0386368 -0.1370828 0.1021537 0.0102014 0.0040144 0.1121702 0.129575 -0.0360192 -0.0201472 -0.0451237 -0.1379365 -0.1286269 0.0162711 0.0034328 -0.0479228 -0.1377419 -0.0071435 0.0086618 -0.0050959 -0.1935113 0.2335651 -0.0447003 -0.0068465 -0.0323304 0.1588082 -0.0268586 -0.0213919 -0.038657 0.2927356 0.0759572 0.0957473 0.0162263 0.0772187 -0.0130124 -0.0406194 0.0107667 -0.0382368 0.1811506 -0.0579098 -0.0893856 -0.015155 -0.0818539 0.0615377 -0.0230278 -0.0072935 -0.020568 0.1930406 0.0623837 -0.0924865 0.0126365 -0.060282 -0.0586749 0.0336846 0.0118969 0.02877 0.1424534 -0.0095362 0.1290667 -0.0283484 0.1064255 -0.0436506 0.0384057 -0.028048 0.0369424 0.141117 0.007807 0.031574 -0.0244058 0.1086448 0.0059962 -0.1025851 0.0837224 -0.1337602 -0.0985567 -0.0715983 -0.0467096 -0.0066308 -0.1470078 0.0265442 -0.0146744 -0.0229198 -0.0149901 0.119861 0.0055453 0.0239525 0.0328187 0.1357749 -0.0740547 0.1074456 -0.0461326 0.1393152 -0.0145964 -0.0142288 0.0968656 -0.0183773 0.1283539 -0.0493463 0.0335593 -0.0272408 0.0317535 0.1504104 0.0351231 -0.072703 0.0059226 -0.1088144 -0.1017144 0.0341355 0.0131745 0.0350147 0.1516132 -0.1436493 -0.0293775 -0.0073275 -0.0311036 0.085294 0.0111779 -0.0093702 0.0085151 0.1671944 unknown
polarizability: 215.6831706|2.399624|125.1042293|1.054581|-0.5865119|56.7147849 unknown
InChI: InChI=1S/C11H11N/c1-9-7-8-11(12-9)10-5-3-2-4-6-10/h2-8,12H,1H3
charge 0 multiplicity 1
23 atoms
N  1.560749 -0.759727 -0.133818
C  0.637944 0.289527 0.028845
C  -0.813641 0.081982 0.009561
C  2.872144 -0.281955 -0.067382
C  1.401068 1.461206 0.209989
C  2.788509 1.103764 0.154356
C  -1.694648 1.187461 -0.175499
C  -1.394219 -1.210853 0.171079
C  4.062147 -1.185369 -0.227833
C  -3.09151 1.008088 -0.195233
C  -2.793168 -1.390155 0.13916
C  -3.653209 -0.28271 -0.043276
H  1.307285 -1.721646 -0.351564
H  0.997515 2.454663 0.398925
H  3.640184 1.772613 0.268591
H  -1.273937 2.188355 -0.320508
H  -0.755918 -2.083982 0.35701
H  4.079132 -1.685392 -1.216209
H  4.990241 -0.597536 -0.140485
H  4.095821 -1.975985 0.547003
H  -3.746106 1.875272 -0.338898
H  -3.213397 -2.394245 0.267602
H  -4.739387 -0.421676 -0.065113
