program: Gaussian 09
title: 000200989
version: EM64L-G09RevD.01
frameworkgroup: C1[X(C12H24N2O2S)]
method: RPBEPBE
basis: SDD
operation: Freq
keyword: #p
keyword: freq=noraman
keyword: PBEPBE/SDD
title: #p freq=noraman PBEPBE/SDD
converged: YES YES NO NO
title: Mulliken charges:
elementType: S O O N N C C C C C C C C C C C C H H H H H H H H H H H H H H H H H H H H H H H H
charge: 0.115929 -0.418163 -0.230716 -0.591853 -0.307704 -0.382657 -0.387119 -0.385540 -0.372090 -0.368470 -0.355862 -0.376392 -0.382175 -0.487716 -0.690648 0.170763 -0.092025 0.192403 0.193815 0.197864 0.194109 0.196513 0.197765 0.194357 0.188607 0.191116 0.191473 0.190683 0.214986 0.218854 0.217403 0.222717 0.209296 0.252127 0.252112 0.283181 0.255481 0.375189 0.325429 0.330838 0.256120
chargesum: 0.00000
title: Mulliken charges with hydrogens summed into heavy atoms:
elementType: S O O N N C C C C C C C C C C C C
charge: 0.115929 -0.042973 -0.230716 0.064413 -0.051584 0.003561 0.004854 0.008737 0.010874 0.014119 0.049807 0.059864 0.049838 0.016523 -0.151985 0.170763 -0.092025
polarizability: 2.38032370e+02 -1.05333706e+01 1.50579657e+02 -7.69991217e+00 -6.43196146e+00 1.28397533e+02
1716.lowfreq: -12.1688 -0.1840 -0.0015 -0.0012 -0.0003 2.7047 10.4646 11.7205 16.2291
frequency: 8.6718 11.4860 16.0856 26.3729 35.9987 37.6524 52.7274 66.3745 78.7251 96.1482 107.7883 117.4770 123.3866 145.2367 150.3791 174.0454 188.8641 238.5368 276.4990 343.6546 357.5592 366.2800 376.0701 431.6451 460.7879 463.9365 480.8778 500.2226 514.8646 572.0008 588.6570 593.2619 635.2335 637.9319 713.1126 720.8272 723.1445 734.8431 764.3397 808.2121 848.0676 856.6169 882.4363 940.1085 972.3956 988.5223 1007.1105 1016.8870 1025.2658 1031.1376 1057.7193 1064.7565 1072.7183 1078.2123 1080.7847 1082.3306 1099.1751 1108.9303 1116.4546 1178.1502 1195.6275 1213.3512 1225.8972 1238.3970 1249.0284 1256.8233 1262.1072 1275.8720 1281.5764 1285.8119 1288.1259 1294.1906 1297.8882 1303.2631 1316.3907 1340.8151 1356.8854 1357.2591 1362.3963 1372.3196 1436.7194 1449.9813 1453.0654 1460.7909 1460.9545 1464.4084 1467.3676 1475.0595 1482.6631 1488.0622 1590.5337 1666.5082 1669.6209 2950.1595 2950.6523 2952.1902 2957.0133 2961.8952 2964.8585 2970.2244 2984.4489 2986.0049 2989.6677 2995.6470 2997.6946 3000.3231 3011.4823 3021.8554 3030.0783 3037.2131 3046.6969 3061.8447 3080.2647 3451.4764 3511.8779 3544.9155 3700.7813
redmass: 6.6228 5.0624 6.9495 5.7772 2.2107 3.6030 3.6744 3.4086 1.8824 4.2051 2.6695 2.6750 3.0987 2.1608 1.9930 4.0569 3.6950 2.5665 4.1446 3.8131 1.2284 3.6482 3.9056 4.1841 1.8361 2.0958 2.8467 1.7890 2.9783 3.6463 4.6697 4.1569 3.6535 1.3127 1.1527 1.0610 1.0890 1.1523 1.2552 1.3598 1.4792 4.8663 1.4028 1.4389 2.4559 4.9476 1.3813 2.4259 3.2049 1.3285 2.4438 2.5710 1.6114 1.9770 2.1140 2.1887 2.4093 2.3865 1.4298 1.3657 1.5521 1.3356 1.3955 1.3898 1.6532 1.5525 1.4943 1.2156 1.0816 1.3388 1.1164 1.1357 1.0991 1.1971 1.3655 1.4674 1.5510 1.7087 1.6139 1.8328 1.0845 1.0884 1.0773 1.0733 1.0756 1.0616 1.0900 1.0971 1.0999 1.1007 1.2107 5.1174 8.2261 1.0590 1.0586 1.0590 1.0598 1.0603 1.0597 1.0619 1.0961 1.0612 1.0976 1.0598 1.0978 1.0620 1.0984 1.1014 1.0998 1.1036 1.1035 1.1031 1.1082 1.0782 1.0639 1.0446 1.1047
irintensity: 1.0527 0.3219 0.0606 0.3913 1.1097 0.3311 2.6982 0.3431 0.2137 0.5747 0.3530 0.3669 1.0676 0.1772 0.0863 1.5653 2.4220 0.6195 1.4051 2.3202 68.3677 4.7595 7.0685 27.5632 91.8488 73.8999 62.5948 28.5624 7.5651 53.0661 17.3823 81.0294 4.4580 129.0757 54.8674 19.5170 1.2855 7.1760 1.3778 6.1866 2.8719 1.2734 1.3502 3.1662 0.6198 46.3169 2.7204 27.2906 102.4800 233.6907 55.9607 18.9967 6.2187 10.2673 0.0939 4.4906 15.6372 6.0134 0.4844 18.0835 12.6715 19.7644 6.6412 1.1823 179.9836 106.5566 36.4259 9.6565 2.8395 25.6371 4.0231 0.2745 0.1189 2.4778 11.1185 12.4021 7.3588 1.1235 1.1447 29.8361 27.4120 11.2790 3.1879 0.4918 0.3407 0.0089 0.3370 5.9948 0.2574 31.8692 81.3042 271.4088 209.2025 1.5815 0.2314 9.6601 0.3485 14.0536 59.7717 137.1547 2.7966 5.2885 2.0552 38.5886 4.4753 17.7442 1.9833 4.4716 2.6588 26.7016 155.4394 90.8564 27.0615 9.5805 17.9196 53.6574 34.3921
temp: 298.150 k
press: 1.00000 atm
elementType: 16 8 8 7 7 6 6 6 6 6 6 6 6 6 6 6 6 1 1 1 1 1 1 1 1 1 1 1 1 1 1 1 1 1 1 1 1 1 1 1 1
symmnumber: 1
zpe: 919609.6 jmol-1
zpe.correction: 0.350261 hartree
zpe.thermalcorrener: 0.372385 hartree
zpe.thermalcorrenthalpy: 0.373329 hartree
zpe.thermalcorrgfe: 0.291449 hartree
zpe.sumelectzpe: -1128.312455 hartree
zpe.sumelectthermal: -1128.290331 hartree
zpe.sumelectthermalent: -1128.289386 hartree
zpe.sumelectthermalfe: -1128.371266 hartree
dipole: 1.0709 -1.6884 -1.6348
dipole: 2.5826
quadrupole: -126.3275 -113.3413 -111.9842
quadrupole: -13.0275 6.3882 -8.2324
quadrupole: -9.1098 3.8763 5.2335 -13.0275 6.3882 -8.2324
hfenergy: -1128.6627156 hartree
pointgroup: C01 [X(C12H24N2O2S1)]
dipole: 0.4229554 0.8303796 0.4049625 debye
polarizability: 238.0548976|12.405043|144.7305109|3.4891574|-11.7790846|134.2241518 unknown
InChI: InChI=1S/C12H24N2O2S/c13-12(14)17-10-8-6-4-2-1-3-5-7-9-11(15)16/h13,15H,1-10,14H2
charge 0 multiplicity 1
41 atoms
S  -5.685406 -0.521129 0.650484
O  8.750682 0.153045 0.261144
O  7.530963 -1.790541 -0.088798
N  -8.16531 -1.434151 1.189853
N  -8.142682 -0.271986 -0.845468
C  1.244625 0.906779 0.029519
C  -0.120881 0.217285 -0.189247
C  2.443781 -0.061475 -0.081739
C  -1.318253 1.186252 -0.065072
C  3.808709 0.634695 0.117878
C  -2.682476 0.50708 -0.31979
C  5.00245 -0.339306 0.010196
C  -3.868842 1.486597 -0.169601
C  6.3529 0.375227 0.205431
C  -5.239842 0.892309 -0.534975
C  7.545052 -0.555541 0.104348
C  -7.513873 -0.709609 0.207419
H  1.364113 1.724592 -0.711901
H  1.255297 1.389877 1.029196
H  -0.238653 -0.607071 0.544417
H  -0.135251 -0.256327 -1.193177
H  2.426007 -0.554263 -1.076181
H  2.331857 -0.871965 0.668106
H  -1.317473 1.640728 0.947906
H  -1.186304 2.02403 -0.781999
H  3.919267 1.442702 -0.635731
H  3.823126 1.131315 1.111034
H  -2.693336 0.072599 -1.341126
H  -2.810389 -0.342465 0.380549
H  4.900113 -1.145037 0.762063
H  4.99116 -0.840314 -0.976872
H  -3.902462 1.881135 0.864985
H  -3.700841 2.359372 -0.834838
H  6.399438 0.875473 1.193212
H  6.48925 1.182629 -0.540768
H  -6.03849 1.649036 -0.444987
H  -5.228162 0.484622 -1.561895
H  9.512674 -0.484593 0.192533
H  -7.734909 -1.614519 2.092487
H  -9.143009 -1.671502 1.032253
H  -7.565319 0.176918 -1.57265
