program: Gaussian 09
title: 000017076
version: EM64L-G09RevD.01
frameworkgroup: C1[X(C12H17NO)]
method: RPBEPBE
basis: SDD
operation: Freq
keyword: #p
keyword: freq=noraman
keyword: PBEPBE/SDD
title: #p freq=noraman PBEPBE/SDD
converged: YES YES NO NO
title: Mulliken charges:
elementType: O N C C C C C C C C C C C C H H H H H H H H H H H H H H H H H
charge: -0.278779 -0.125238 -0.349308 -0.390023 -0.682765 0.259414 0.495362 -0.661506 -0.643977 -0.450887 -0.341034 -0.225344 -0.237917 -0.243369 0.261024 0.202229 0.239676 0.224227 0.244547 0.227480 0.201959 0.251974 0.216907 0.222109 0.222622 0.217503 0.219965 0.253625 0.221822 0.222815 0.224886
chargesum: 0.00000
title: Mulliken charges with hydrogens summed into heavy atoms:
elementType: O N C C C C C C C C C C C C
charge: -0.278779 -0.125238 0.113945 0.073881 -0.210738 0.259414 0.495362 0.009334 0.018258 -0.230922 -0.087409 -0.003522 -0.015102 -0.018484
polarizability: 1.81746082e+02 6.54117391e+00 1.40281808e+02 1.09627700e+01 -3.72604133e+00 8.89248597e+01
1716.lowfreq: -12.3930 -1.0909 -0.0003 0.0002 0.0005 6.0111 9.7019 28.2960 52.8518
frequency: 8.3632 28.2646 52.8413 77.9125 97.4025 114.6749 128.3547 198.1927 217.5770 239.1941 254.5737 311.2124 327.6564 365.1274 404.4992 427.0364 463.6517 484.8075 557.5554 577.5120 615.6072 618.7262 700.0772 724.8547 765.3151 779.0333 790.0863 829.4453 845.2708 898.5091 905.1535 940.0274 942.8891 968.0158 989.3052 991.8579 1018.8418 1028.5717 1071.1078 1079.5378 1082.1656 1095.9449 1130.7044 1170.4435 1178.9618 1189.5981 1209.7240 1218.6735 1247.0856 1287.9043 1300.7008 1332.1622 1340.6954 1357.7802 1381.5418 1384.6408 1389.7277 1405.1579 1438.2133 1451.1962 1459.1013 1467.0094 1468.6224 1479.3234 1482.9485 1484.9945 1499.1619 1588.1888 1594.7288 1616.1533 2965.6370 2982.7269 2983.6529 2999.2151 3004.6382 3052.1973 3061.0748 3067.3055 3082.6559 3084.9105 3090.3696 3102.5024 3109.2145 3124.0715 3137.9907 3155.0005 3170.5830
redmass: 4.0227 3.6250 3.0011 3.3068 4.8503 3.0336 3.1577 1.3160 1.1881 4.0677 1.6320 2.7566 2.4739 3.2275 2.8001 2.6560 3.1793 3.2753 3.5435 4.2398 4.1252 5.3205 1.9946 1.9476 1.8152 1.2153 1.5098 3.4906 1.2492 2.1293 1.6814 2.1515 2.0750 1.3947 2.0201 2.3381 2.8345 2.1737 2.0512 1.7869 1.6384 1.7733 1.9046 1.0657 1.1900 1.1319 2.5783 2.2989 1.5481 1.5541 1.3632 1.2836 1.2766 1.2898 1.2248 6.3579 1.2478 2.3187 1.9096 1.1415 1.1616 1.0558 1.0446 1.0567 1.0569 2.3241 1.1047 6.5094 6.0318 6.2554 1.0661 1.0360 1.0355 1.0644 1.0641 1.0959 1.0948 1.0990 1.0993 1.0983 1.1014 1.1018 1.0873 1.0868 1.0928 1.0977 1.0980
irintensity: 1.1380 0.0692 0.4412 1.0331 3.1954 1.9437 0.9735 0.2553 0.6879 1.8092 0.7206 1.6941 1.6591 14.3014 0.3299 6.6648 4.4418 0.6360 15.9062 10.0788 1.1151 1.7320 40.6538 48.4950 11.0767 7.1676 14.6919 4.9156 0.3988 9.6862 0.3172 9.6314 6.2416 0.4130 0.0522 0.2961 4.2921 7.6313 12.0750 9.6825 7.4044 18.9205 80.8855 0.3283 1.4525 1.5867 24.6968 6.8236 67.8130 11.6702 49.8110 4.5515 9.1233 9.9447 18.8622 1.0620 25.4162 120.3678 3.7684 40.2526 15.2455 7.2718 13.4506 5.3690 12.7598 16.5626 11.5836 222.2751 1.5276 17.9084 18.9857 29.2949 22.2549 38.2462 37.0144 14.4108 5.9298 13.9506 45.1062 41.1891 44.1524 30.5830 12.6274 1.8758 35.5239 38.2880 7.1419
temp: 298.150 k
press: 1.00000 atm
elementType: 8 7 6 6 6 6 6 6 6 6 6 6 6 6 1 1 1 1 1 1 1 1 1 1 1 1 1 1 1 1 1
symmnumber: 1
zpe: 692312.7 jmol-1
zpe.correction: 0.263688 hartree
zpe.thermalcorrener: 0.278379 hartree
zpe.thermalcorrenthalpy: 0.279323 hartree
zpe.thermalcorrgfe: 0.219250 hartree
zpe.sumelectzpe: -596.395672 hartree
zpe.sumelectthermal: -596.380981 hartree
zpe.sumelectthermalent: -596.380037 hartree
zpe.sumelectthermalfe: -596.440109 hartree
dipole: 2.8185 2.9531 1.3431
dipole: 4.2975
quadrupole: -72.4995 -82.8280 -86.5343
quadrupole: 3.0168 1.8109 -2.3138
quadrupole: 8.1211 -2.2074 -5.9137 3.0168 1.8109 -2.3138
hfenergy: -596.6593598 hartree
pointgroup: C01 [X(C12H17N1O1)]
dipole: 1.1446956 1.1780159 0.4008054 debye
polarizability: 181.9223916|6.4565281|138.133518|11.1241737|-10.0556208|90.8968397 unknown
InChI: InChI=1S/C12H17NO/c1-3-13(4-2)12(14)10-11-8-6-5-7-9-11/h5-9H,3-4,10H2,1-2H3
charge 0 multiplicity 1
31 atoms
O  0.658949 -1.636803 -0.232006
N  2.320964 -0.047081 0.063294
C  3.30603 -0.965638 -0.563305
C  2.834292 1.252038 0.554007
C  -0.008032 0.491304 0.828602
C  1.002136 -0.480384 0.169125
C  -1.453805 0.268089 0.409141
C  3.986568 -1.894837 0.463908
C  2.837987 2.356051 -0.527809
C  -2.176552 1.313088 -0.219065
C  -2.113594 -0.963425 0.656953
C  -3.529823 1.139451 -0.591383
C  -3.4650 -1.139026 0.287441
C  -4.179513 -0.089244 -0.336685
H  2.767101 -1.572835 -1.309554
H  4.058392 -0.349607 -1.091525
H  2.251469 1.578013 1.432295
H  3.86672 1.085902 0.9166
H  0.088035 0.351032 1.926099
H  0.268722 1.539156 0.621362
H  4.508168 -1.318835 1.250834
H  3.233426 -2.543074 0.942787
H  4.73142 -2.540503 -0.036771
H  3.431345 2.04468 -1.406078
H  1.812844 2.575752 -0.875754
H  3.277351 3.289231 -0.129304
H  -1.679249 2.270863 -0.419781
H  -1.557445 -1.786586 1.114976
H  -4.072405 1.959007 -1.076496
H  -3.960498 -2.097009 0.482456
H  -5.228603 -0.22837 -0.621864
