program: Gaussian 09
title: 000200983
version: EM64L-G09RevD.01
frameworkgroup: C1[X(C14H20NO2)]
method: RPBEPBE
basis: SDD
operation: Freq
keyword: #p
keyword: freq=noraman
keyword: PBEPBE/SDD
title: #p freq=noraman PBEPBE/SDD
converged: NO YES NO NO
title: Mulliken charges:
elementType: O O N C C C C C C C C C C C C C C H H H H H H H H H H H H H H H H H H H H
charge: -0.183351 -0.126749 -0.124570 -0.344154 -0.376560 -0.308041 -0.297645 -0.357807 0.165113 0.465227 -0.696967 -0.709144 -0.393857 -0.351433 -0.223460 -0.239401 -0.215656 0.296116 0.282654 0.303376 0.281793 0.264791 0.286445 0.263067 0.278282 0.260646 0.274798 0.243796 0.245352 0.273881 0.243667 0.239946 0.242010 0.261825 0.257632 0.256134 0.262242
chargesum: 1.00000
title: Mulliken charges with hydrogens summed into heavy atoms:
elementType: O O N C C C C C C C C C C C C C C
charge: -0.183351 -0.126749 -0.124570 -0.048037 0.209471 0.238542 0.251867 0.181122 0.165113 0.465227 0.066980 0.048350 -0.151847 -0.089608 0.034173 0.016733 0.046587
polarizability: 1.84859370e+02 -7.90309735e+00 1.42641573e+02 -3.61503833e+00 -1.14704360e+01 1.38654369e+02
1716.lowfreq: -6.0512 -0.0005 0.0001 0.0005 5.8996 11.0894 46.8915 70.8891 75.6283
frequency: 46.8636 70.8869 75.6187 92.7167 105.1815 129.0995 140.9162 185.2617 205.9455 232.6174 236.2762 261.9565 278.9305 301.3675 338.3804 341.1951 361.1869 389.6116 406.8365 465.4561 481.0978 510.8380 525.3100 582.3326 612.9856 620.5860 670.1015 701.0781 712.0569 748.7044 765.7374 784.3150 801.5039 830.6967 838.0756 857.8346 885.9193 892.5712 916.9719 945.3406 987.4758 990.4917 1000.3599 1010.7743 1016.7861 1027.7486 1032.1045 1064.0997 1074.6553 1086.1605 1095.8503 1122.0477 1139.9631 1151.7510 1168.9029 1185.6663 1196.7826 1202.3876 1229.4141 1253.4070 1261.8714 1277.7394 1310.3685 1325.3605 1342.1959 1362.3164 1372.3098 1375.9684 1383.3063 1388.7185 1414.1524 1420.1289 1445.6714 1464.8615 1469.9058 1473.9959 1475.0200 1480.9511 1485.4462 1487.3627 1495.0180 1496.6080 1589.3790 1603.9952 1679.1302 3005.5402 3007.2978 3032.6645 3036.8781 3045.4887 3047.5787 3086.9927 3090.5854 3094.7651 3095.7648 3099.0701 3104.7952 3117.3477 3118.4516 3122.2817 3123.9062 3133.7953 3153.9723 3165.1795 3180.6639
redmass: 3.9301 4.6768 4.5161 1.9357 5.8643 2.9171 2.7259 3.4320 2.3307 1.3039 1.6231 4.1949 2.7737 2.5500 2.6027 2.3926 4.0762 2.9746 2.7856 3.3783 3.9411 4.4375 4.4286 4.3917 6.2939 3.3305 7.1582 2.4937 1.8494 1.8110 4.3974 1.3287 1.8088 1.9214 2.8301 1.2494 2.9689 2.0864 2.4196 1.5298 1.9414 2.7366 2.5421 1.8360 1.3540 2.3242 3.1272 3.0354 1.8390 2.5228 1.7335 2.8956 2.4055 1.9150 1.7606 1.0765 1.9741 1.2214 1.1760 1.2040 1.5339 1.1313 1.1884 1.2302 1.2643 1.2667 1.3111 1.2998 1.4109 4.4293 1.2124 1.1853 2.0516 1.0747 1.0719 1.0533 1.0774 2.1223 1.0466 1.0599 1.0687 1.0701 5.7757 5.8842 11.7665 1.0377 1.0379 1.0614 1.0627 1.0603 1.0602 1.0877 1.1026 1.0991 1.0985 1.1003 1.1026 1.1033 1.1064 1.1015 1.0931 1.0894 1.0899 1.0953 1.1013
irintensity: 1.6810 0.6958 2.1139 1.9018 2.1890 1.7100 2.4874 1.9351 1.4122 1.1665 0.9534 1.5083 2.2375 0.8990 1.6807 0.5551 1.0724 1.3108 0.5376 0.2961 7.2926 1.3659 9.1344 9.6537 0.5927 4.1897 4.3831 23.2766 17.5611 121.2205 24.3111 17.9255 15.8264 1.3860 17.1038 0.1133 21.3266 10.6909 10.8597 1.0576 3.3364 2.9026 17.7337 18.2001 0.2973 1.1085 37.3989 17.6169 13.6100 63.6263 13.2798 85.9698 40.3525 13.7382 1.5606 1.0279 23.7993 1.9772 9.8708 21.3362 6.6356 6.9623 5.2037 0.7152 1.7085 0.5281 3.7039 0.3636 0.9479 1.4835 27.3351 38.9919 9.1034 24.9334 15.4453 40.2070 34.8345 9.1025 3.8821 18.5301 5.0440 4.9431 2.8426 4.4357 216.4989 4.7272 3.3058 2.7956 22.3365 6.6874 0.6541 0.8638 1.0660 4.5666 1.4000 10.7968 1.7492 20.0307 2.3703 4.9996 14.5351 2.6052 0.9104 7.2945 5.5677
temp: 298.150 k
press: 1.00000 atm
elementType: 8 8 7 6 6 6 6 6 6 6 6 6 6 6 6 6 6 1 1 1 1 1 1 1 1 1 1 1 1 1 1 1 1 1 1 1 1
symmnumber: 1
zpe: 832194.1 jmol-1
zpe.correction: 0.316966 hartree
zpe.thermalcorrener: 0.333410 hartree
zpe.thermalcorrenthalpy: 0.334354 hartree
zpe.thermalcorrgfe: 0.273779 hartree
zpe.sumelectzpe: -749.130202 hartree
zpe.sumelectthermal: -749.113758 hartree
zpe.sumelectthermalent: -749.112814 hartree
zpe.sumelectthermalfe: -749.173389 hartree
dipole: -4.4367 -5.9944 -3.6335
dipole: 8.2958
quadrupole: -61.7908 -97.6423 -88.8874
quadrupole: -0.0248 -0.4906 -11.6385
quadrupole: 20.9827 -14.8688 -6.1139 -0.0248 -0.4906 -11.6385
hfenergy: -749.4471677 hartree
pointgroup: C01 [X(C14H20N1O2)]
dipole: -1.7220097 -2.3985521 -1.3906997 debye
polarizability: 184.7710447|-6.0369253|142.8358072|-7.2708155|-11.0030616|138.5484593 unknown
InChI: InChI=1S/C14H20NO2/c1-3-15(4-2)10-11-17-14(16)13(15)12-8-6-5-7-9-12/h5-9,13H,3-4,10-11H2,1-2H3
charge 1 multiplicity 1
37 atoms
O  -1.069359 2.369975 -0.27618
O  -0.212429 2.356002 1.846821
N  -1.356744 -0.543634 -0.111917
C  -0.231966 0.199318 0.732761
C  -1.449683 0.164203 -1.467955
C  -2.713285 -0.433803 0.64308
C  -0.952682 -2.02368 -0.323897
C  -1.836249 1.637925 -1.318901
C  -0.536779 1.710416 0.84315
C  1.189715 -0.034533 0.235041
C  -2.81911 -1.244884 1.940133
C  -1.986623 -2.878601 -1.065914
C  1.978279 -1.03058 0.8707
C  1.773219 0.764023 -0.786508
C  3.31155 -1.253105 0.467592
C  3.106882 0.53849 -1.188388
C  3.875985 -0.473935 -0.569243
H  -0.329321 -0.216413 1.747812
H  -2.207505 -0.350234 -2.080126
H  -0.46535 0.046222 -1.948443
H  -2.864721 0.636447 0.861341
H  -3.486168 -0.746332 -0.079097
H  0.004279 -2.000167 -0.869082
H  -0.752894 -2.428317 0.681483
H  -1.628561 2.170049 -2.260593
H  -2.905133 1.77306 -1.078783
H  -3.822456 -1.058655 2.362738
H  -2.73326 -2.332333 1.783666
H  -2.094695 -0.932815 2.710936
H  -1.579934 -3.90322 -1.132162
H  -2.953813 -2.952128 -0.541632
H  -2.165315 -2.545512 -2.102055
H  1.560588 -1.618749 1.69722
H  1.215123 1.593974 -1.235465
H  3.912621 -2.017733 0.969364
H  3.55263 1.165591 -1.966761
H  4.913766 -0.638828 -0.875733
