program: Gaussian 09
title: 000200986
version: EM64L-G09RevD.01
frameworkgroup: C1[X(C11H18NO5PS2)]
method: RPBEPBE
basis: SDD
operation: Freq
keyword: #p
keyword: freq=noraman
keyword: PBEPBE/SDD
title: #p freq=noraman PBEPBE/SDD
converged: YES YES NO NO
title: Mulliken charges:
elementType: S S P O O O O O N C C C C C C C C C C C H H H H H H H H H H H H H H H H H H
charge: 0.982509 -0.211738 0.867415 -0.491753 -0.536452 -0.536133 -0.479630 -0.458699 -0.233315 -0.118747 -0.205241 -0.201098 0.376220 -0.304974 -0.354753 -0.619465 -0.619307 -0.212419 -0.650451 -0.476129 0.283603 0.288514 0.281456 0.266069 0.212480 0.276153 0.249965 0.211631 0.249650 0.276152 0.236100 0.229725 0.215315 0.230589 0.241498 0.248623 0.242729 0.243909
chargesum: 0.00000
title: Mulliken charges with hydrogens summed into heavy atoms:
elementType: S S P O O O O O N C C C C C C C C C C C
charge: 0.982509 -0.211738 0.867415 -0.491753 -0.536452 -0.536133 -0.479630 -0.458699 -0.233315 -0.118747 0.078363 0.087417 0.376220 -0.023518 -0.088684 0.119133 0.118125 0.253406 0.036951 0.259132
polarizability: 2.81178563e+02 -2.23551823e-01 1.98638189e+02 7.14116757e+00 5.76930686e+00 1.82766750e+02
1716.lowfreq: -16.4027 -11.6094 -2.1523 0.0009 0.0014 0.0016 3.2955 5.0589 24.7114
frequency: -15.1140 -4.7534 24.2554 33.7128 45.7920 49.0819 57.2826 63.6564 74.1781 95.0305 110.9016 115.1022 135.3231 159.2923 185.4687 203.7598 206.8449 224.6715 226.2468 232.8918 248.1984 250.3040 263.7408 288.7962 294.0068 301.3629 311.8629 333.4130 386.8297 391.4731 401.4152 414.2342 434.8540 444.6393 478.8132 498.0931 527.3310 571.1069 616.7103 684.3156 689.5059 707.5597 714.0361 808.1059 808.6632 827.9113 835.7513 849.4339 856.0558 871.8300 953.4882 963.4286 965.1507 976.0449 991.3750 1014.8940 1016.4716 1044.9332 1080.2164 1105.3832 1108.4111 1110.4626 1115.7380 1130.9712 1131.9533 1167.9328 1171.6298 1193.9686 1208.4832 1251.4289 1287.3572 1352.1532 1382.3570 1395.3546 1399.5545 1405.2926 1417.7588 1424.0820 1454.8766 1457.7264 1458.3792 1461.4147 1464.8928 1469.3788 1469.8496 1475.9752 1479.3330 1485.5384 1583.3067 1593.6940 2917.3765 2920.3932 2986.7034 2993.8275 2998.5315 3040.5838 3042.0118 3063.1533 3093.0890 3094.5482 3096.9362 3098.4079 3113.6425 3135.6393 3152.7142 3156.7472 3169.6247 3180.5049
redmass: 2.3185 4.1653 5.0947 3.6671 3.1398 3.5886 4.3676 3.4161 4.3408 5.8913 5.4775 1.1348 5.5363 5.2967 6.7246 3.0515 4.7531 1.4755 1.1520 4.0259 1.9373 2.4754 4.7151 3.4910 4.4838 5.3330 4.7147 6.6840 7.0353 3.4475 5.7896 2.9842 8.9903 6.1562 6.2533 7.2186 4.1356 7.6680 7.3436 9.5754 10.6198 6.8662 3.8868 8.5606 1.1589 5.5731 1.2923 1.5754 4.3763 4.7401 15.1316 1.3369 10.3987 1.3687 5.2814 2.4836 1.4330 2.4001 1.2294 2.2143 1.3106 1.3728 1.2503 1.4015 1.3101 1.3478 4.9992 2.7141 1.6670 1.1506 1.2523 1.2546 6.5116 1.2392 3.5891 1.1471 1.1394 1.1183 1.0476 1.0407 1.0519 2.1484 1.0500 1.0570 1.0527 1.0563 1.0619 1.0784 6.1372 7.9570 1.0467 1.0461 1.0303 1.0517 1.0414 1.0872 1.0856 1.1078 1.1046 1.0982 1.0983 1.0995 1.1025 1.1035 1.0887 1.0895 1.0971 1.0967
irintensity: 0.1107 1.9128 0.8319 0.0629 0.8557 7.4355 3.0479 0.1396 2.4555 2.7815 2.3130 0.0153 0.6871 4.3161 3.1638 1.9150 2.0466 1.0309 0.6170 17.3223 1.5676 0.2958 12.9171 10.4369 7.6068 6.5337 1.1147 0.4358 10.9984 4.4665 7.6589 0.0577 36.1025 42.0823 119.6207 6.9914 87.6421 78.5364 2.4609 109.1661 100.0470 104.2725 3.4638 58.7243 8.6345 264.5100 12.4525 54.0046 42.5603 197.1596 72.7893 0.6972 192.0977 0.6210 9.9879 123.9664 0.6029 32.4865 0.0008 17.5636 13.6828 18.9917 1.9666 4.5058 1.5083 116.3265 11.6063 213.4717 12.1005 0.2677 3.4647 9.8792 4.5042 27.4877 6.9975 28.3672 2.6066 5.9564 26.1660 16.0729 12.2876 141.8255 1.5311 2.5542 17.8216 6.8065 31.5330 11.4239 86.0216 9.1631 26.4291 80.6455 44.2337 22.5945 21.4362 3.8544 43.9913 9.3242 18.6897 29.0360 1.9532 2.2062 29.2062 12.8068 0.2731 0.8291 1.5264 4.4091
temp: 298.150 k
press: 1.00000 atm
elementType: 16 16 15 8 8 8 8 8 7 6 6 6 6 6 6 6 6 6 6 6 1 1 1 1 1 1 1 1 1 1 1 1 1 1 1 1 1 1
symmnumber: 1
zpe: 743054.0 jmol-1
zpe.correction: 0.283014 hartree
zpe.thermalcorrener: 0.306319 hartree
zpe.thermalcorrenthalpy: 0.307263 hartree
zpe.thermalcorrgfe: 0.228614 hartree
zpe.sumelectzpe: -1996.431083 hartree
zpe.sumelectthermal: -1996.407778 hartree
zpe.sumelectthermalent: -1996.406834 hartree
zpe.sumelectthermalfe: -1996.485483 hartree
dipole: -7.2306 -2.3111 3.5967
dipole: 8.4000
quadrupole: -152.7117 -128.4819 -148.8072
quadrupole: -13.2790 18.5146 5.9438
quadrupole: -9.3782 14.8517 -5.4736 -13.2790 18.5146 5.9438
hfenergy: -1996.7140969 hartree
pointgroup: C01 [X(C11H18N1O5P1S2)]
dipole: 2.7955697 0.9021468 1.5141439 debye
polarizability: 281.2471258|3.0429463|199.4697915|-5.5950351|-4.8028994|181.8665846 unknown
InChI: InChI=1S/C11H18NO5PS2/c1-5-16-18(19,15-4)17-10-6-8-11(9-7-10)20(13,14)12(2)3/h6-9H,5H2,1-4H3
charge 0 multiplicity 1
38 atoms
S  -3.959175 -0.501906 -0.515514
S  2.836482 0.77048 2.29511
P  3.176356 0.524646 0.280045
O  1.911627 1.010691 -0.829207
O  -4.731378 0.511639 -1.525714
O  -4.053396 -2.122066 -0.615694
O  3.481497 -1.054766 -0.323537
O  4.486707 1.387407 -0.424027
N  -4.624775 -0.075617 1.211638
C  -2.121427 -0.047016 -0.580215
C  -1.176268 -1.020029 -0.210849
C  -1.770079 1.24084 -1.023418
C  0.561751 0.617289 -0.688954
C  0.192044 -0.682664 -0.26879
C  -0.402317 1.578615 -1.070287
C  -3.986251 -0.924596 2.243394
C  -4.557104 1.384115 1.451585
C  4.609547 -1.838321 0.284622
C  4.558493 -3.217018 -0.363085
C  4.745741 2.781231 0.010555
H  -1.500694 -2.02584 0.074637
H  -2.543199 1.945246 -1.346518
H  0.96188 -1.420217 -0.021869
H  -0.069804 2.564116 -1.407513
H  -2.955332 -0.606637 2.519237
H  -3.977317 -1.968517 1.888434
H  -4.622423 -0.877348 3.145812
H  -3.536278 1.757676 1.693788
H  -5.224556 1.606894 2.303687
H  -4.950692 1.909273 0.565515
H  5.553573 -1.308946 0.061489
H  4.459603 -1.883812 1.380394
H  5.377233 -3.843728 0.035998
H  3.599574 -3.718421 -0.148802
H  4.678489 -3.139373 -1.456394
H  5.757915 3.002269 -0.357824
H  4.708161 2.862396 1.112417
H  4.01089 3.462113 -0.451649
