program: Gaussian 09
title: 000200945
version: EM64L-G09RevD.01
frameworkgroup: C1[X(C16H18O2)]
method: RPBEPBE
basis: SDD
operation: Freq
keyword: #pfreq=noraman
keyword: PBEPBE/SDD
title: #p freq=noraman PBEPBE/SDD
converged: YES YES NO NO
title: Mulliken charges:
elementType: O O C C C C C C C C C C C C C C C C H H H H H H H H H H H H H H H H H H
charge: -0.435926 -0.435925 -0.261757 -0.261719 0.580047 0.580105 -0.735237 -0.735247 -0.451239 -0.451278 -0.369077 -0.369117 -0.386609 -0.386604 -0.372425 -0.372423 0.275822 0.275822 0.212181 0.212167 0.238360 0.203901 0.226429 0.238374 0.203912 0.226425 0.231170 0.231171 0.228293 0.228292 0.216703 0.216703 0.247336 0.247336 0.352017 0.352016
chargesum: 0.00000
title: Mulliken charges with hydrogens summed into heavy atoms:
elementType: O O C C C C C C C C C C C C C C C C
charge: -0.083909 -0.083909 -0.049577 -0.049552 0.580047 0.580105 -0.066547 -0.066536 -0.220069 -0.220107 -0.140784 -0.140825 -0.169906 -0.169901 -0.125089 -0.125088 0.275822 0.275822
polarizability: 2.70950935e+02 -8.28975144e+00 1.63678162e+02 -1.51570329e+01 -1.33640514e+01 1.05486696e+02
1716.lowfreq: -11.3096 -4.9586 -0.0004 0.0003 0.0005 4.2034 23.1800 26.9652 44.5413
frequency: 23.1799 26.9652 44.5412 45.9254 86.0306 163.8928 168.9993 186.7123 196.9188 231.2647 240.6797 256.5986 271.7402 347.1508 347.7248 364.3550 367.3113 391.5005 396.6102 410.3666 411.5004 461.7979 467.9707 487.4881 543.3093 543.6420 557.7010 633.3273 637.9782 709.5141 723.0494 734.2357 756.3153 803.5616 806.1084 813.2515 815.4919 833.8761 834.3366 856.3767 928.4701 929.3845 954.7850 955.4757 962.7649 997.2511 1001.9433 1008.0232 1014.1623 1062.5940 1091.4519 1102.4664 1105.2721 1135.9517 1141.4712 1147.7919 1177.6829 1178.8762 1208.5364 1216.8200 1243.0389 1246.2637 1246.3685 1285.8367 1292.2007 1311.6061 1328.8856 1346.9703 1387.4419 1387.6525 1390.9986 1393.6002 1426.1654 1427.3965 1473.8863 1473.9905 1477.6888 1478.8894 1502.2566 1502.7700 1596.3162 1596.4825 1624.7926 1625.8670 2958.4202 2975.6913 2979.6668 2979.8450 3071.4721 3072.4611 3087.6291 3088.5248 3106.3219 3106.3453 3122.3931 3122.8071 3132.2476 3132.2916 3165.8468 3165.8668 3581.5458 3581.6430
redmass: 4.0154 4.3765 5.7296 3.4254 5.1322 6.3013 3.9737 3.1795 3.5068 1.2435 1.0851 3.8381 2.1817 1.1044 1.1135 4.1514 3.8624 3.8553 4.9834 2.8977 3.0094 3.6803 3.5123 3.7944 2.3781 2.5377 4.4640 6.9736 6.8459 4.0955 3.1324 3.3639 2.9302 1.7598 1.3479 2.3085 5.3460 1.6675 1.5766 2.2176 1.3920 1.3816 1.3631 1.3695 1.3288 2.6213 2.9592 2.1875 1.6437 1.9654 2.1159 1.4837 1.8264 1.8165 1.3882 1.4889 1.1067 1.1118 1.7961 1.9713 1.6624 2.7931 2.8242 1.3472 1.6207 1.2997 1.3216 1.4498 1.3408 1.4186 3.4455 3.2006 2.6646 2.6236 1.0577 1.0696 1.0460 1.0523 2.6484 2.7034 6.3829 6.2995 6.4760 6.5113 1.0816 1.0751 1.0361 1.0456 1.0985 1.0981 1.1001 1.0999 1.0874 1.0873 1.0891 1.0892 1.0959 1.0959 1.0951 1.0951 1.0660 1.0660
irintensity: 1.5134 1.2150 0.2611 0.0000 0.0000 0.0000 1.0185 0.5413 0.0000 0.2824 0.0000 0.0000 0.3247 0.1156 287.3893 0.0000 21.1609 0.0000 5.1409 0.0000 1.9720 13.7972 0.0000 2.5823 68.0525 0.0019 0.0000 0.0000 2.3033 33.4362 0.0000 6.5169 0.0000 0.0000 46.0379 0.0000 21.3128 0.0001 88.7711 0.0000 0.0000 0.4443 0.1387 0.0000 4.9430 30.4091 0.0000 1.9307 0.0000 14.1088 0.0000 145.9688 0.0000 0.0001 472.0564 0.0000 11.7158 0.0000 0.6785 0.0000 8.5237 71.1660 0.0291 5.0934 0.0000 0.0000 29.0799 0.0000 0.0624 34.7195 0.0001 23.3463 21.1225 0.0001 2.4838 0.0001 22.7905 0.0003 0.0001 214.1312 0.0000 21.4133 0.0000 56.6161 0.0000 25.9803 0.0643 60.1737 0.0005 59.5713 0.0061 85.4677 44.5455 0.0000 0.0045 40.5216 30.0909 0.0023 14.0185 0.0497 80.9614 0.2138
temp: 298.150 k
press: 1.00000 atm
elementType: 8 8 6 6 6 6 6 6 6 6 6 6 6 6 6 6 6 6 1 1 1 1 1 1 1 1 1 1 1 1 1 1 1 1 1 1
symmnumber: 1
zpe: 776489.2 jmol-1
zpe.correction: 0.295749 hartree
zpe.thermalcorrener: 0.313070 hartree
zpe.thermalcorrenthalpy: 0.314014 hartree
zpe.thermalcorrgfe: 0.249537 hartree
zpe.sumelectzpe: -769.632043 hartree
zpe.sumelectthermal: -769.614722 hartree
zpe.sumelectthermalent: -769.613778 hartree
zpe.sumelectthermalfe: -769.678256 hartree
dipole: -0.0004 0.0001 0.0000
dipole: 0.0004
quadrupole: -101.0822 -96.5808 -113.2405
quadrupole: -22.4308 3.2584 -3.3728
quadrupole: 2.5523 7.0537 -9.6060 -22.4308 3.2584 -3.3728
hfenergy: -769.9277924 hartree
pointgroup: C01 [X(C16H18O2)]
dipole: 0.0001539 -0.0000374 -0.0000075 debye
polarizability: 270.5940734|-6.1144657|166.4401541|17.87341|3.4294515|103.0815654 unknown
InChI: InChI=1S/C16H18O2/c1-11(13-3-7-15(17)8-4-13)12(2)14-5-9-16(18)10-6-14/h3-12,17-18H,1-2H3
charge 0 multiplicity 1
36 atoms
O  -6.11073 -0.211341 -0.346933
O  6.11144 0.220226 0.344553
C  -0.421772 0.24759 0.618062
C  0.422378 -0.240532 -0.618977
C  -1.926133 0.14743 0.356934
C  1.926767 -0.139905 -0.358168
C  -0.029613 -0.514766 1.910759
C  0.029828 0.521481 -1.911757
C  -2.742626 1.303629 0.327858
C  2.743648 -1.295834 -0.329363
C  -2.555376 -1.110161 0.145413
C  2.555654 1.117887 -0.146783
C  -4.13521 1.222275 0.098266
C  4.13627 -1.214028 -0.100153
C  -3.939857 -1.213372 -0.088062
C  3.940164 1.221547 0.08632
C  -4.732366 -0.042245 -0.110888
C  4.733067 0.05068 0.108884
H  -0.179364 1.320304 0.770848
H  0.180196 -1.313328 -0.771539
H  1.04052 -0.375562 2.1427
H  -0.21299 -1.600859 1.803961
H  -0.625368 -0.157665 2.769661
H  -1.040346 0.382104 -2.143414
H  0.213135 1.607614 -1.805244
H  0.625424 0.164242 -2.770712
H  -2.285365 2.287845 0.487795
H  2.286668 -2.280197 -0.489204
H  -1.95686 -2.028939 0.165489
H  1.956824 2.036466 -0.166651
H  -4.745199 2.135384 0.083165
H  4.746562 -2.126937 -0.085251
H  -4.423332 -2.181398 -0.251001
H  4.423363 2.189726 0.249166
H  -6.576073 0.66169 -0.342255
H  6.577071 -0.652651 0.339728
