program: Gaussian 09
title: 000200974
version: EM64L-G09RevD.01
frameworkgroup: C1[X(C14H21ClNO5P)]
method: RPBEPBE
basis: SDD
operation: Freq
keyword: #p
keyword: freq=noraman
keyword: PBEPBE/SDD
title: #p freq=noraman PBEPBE/SDD
converged: YES YES NO NO
title: Mulliken charges:
elementType: Cl P O O O O O N C C C C C C C C C C C C C C H H H H H H H H H H H H H H H H H H H H H
charge: -0.085889 1.254242 -0.490384 -0.545574 -0.601630 -0.212631 -0.217493 0.021874 -0.314442 -0.349134 -0.791102 -0.346967 -0.349023 -0.591252 -0.242055 0.387116 -0.646339 -0.297520 -0.361730 -0.343863 -0.335132 0.379732 0.235232 0.223195 0.193402 0.196765 0.266355 0.298599 0.196320 0.219034 0.228815 0.207861 0.268875 0.258439 0.234918 0.201255 0.243428 0.242607 0.213054 0.310783 0.262979 0.288464 0.288814
chargesum: 0.00000
title: Mulliken charges with hydrogens summed into heavy atoms:
elementType: Cl P O O O O O N C C C C C C C C C C C C C C
charge: -0.085889 1.254242 -0.490384 -0.545574 -0.601630 -0.212631 -0.217493 0.021874 0.143985 0.041033 -0.226148 0.068388 0.087653 -0.063938 0.194119 0.387116 0.052751 0.013263 -0.098750 -0.055399 -0.046319 0.379732
polarizability: 3.27369012e+02 8.22177656e+00 1.65825050e+02 -2.39284359e+00 1.38916005e+01 1.77269941e+02
1716.lowfreq: -19.1606 -1.7130 -0.0014 -0.0007 -0.0005 4.3356 8.6872 13.9267 16.1010
frequency: -16.6638 11.8119 15.2414 21.9255 31.1721 37.2324 50.9624 71.6603 74.7127 80.4068 97.2211 101.7816 116.4306 128.1910 148.6127 160.6109 164.3310 189.8617 212.9361 232.6850 240.4764 271.8348 286.1474 305.1851 330.2511 345.0186 352.4025 403.7797 413.8244 415.1772 451.9279 488.6594 496.9506 510.6548 553.8360 596.1390 600.4892 624.1832 665.7957 667.2692 728.9524 733.6573 736.0028 758.5130 777.0583 798.1525 809.2570 834.8308 837.3190 857.6483 868.8954 876.4115 927.1004 982.8187 983.9388 995.2354 998.5780 1009.7841 1020.4137 1038.8356 1048.3753 1061.8699 1076.8959 1092.2654 1093.5710 1097.2116 1108.1687 1115.4822 1138.6446 1168.3256 1174.3233 1208.8926 1221.1280 1224.1371 1239.3420 1265.5638 1268.5670 1281.6097 1292.5727 1293.1809 1297.9297 1309.7786 1333.1138 1348.5163 1356.2089 1363.1512 1370.3407 1390.5083 1396.9594 1424.4123 1429.3581 1446.7288 1450.9686 1460.3119 1464.7863 1467.7621 1473.5532 1475.1420 1484.3245 1487.9710 1589.3534 1603.1692 2958.0643 2960.1906 2974.5171 2985.0262 2991.2911 2992.9753 3003.7011 3023.5232 3023.8959 3042.7553 3051.2976 3056.9988 3068.7857 3087.9281 3093.7472 3112.7162 3132.2196 3158.0273 3166.9969 3184.4573 3188.9441
redmass: 2.5851 8.0958 8.6463 5.1884 4.9820 4.8627 3.5754 7.1994 4.1190 4.1345 2.6228 6.1763 3.3765 3.2428 2.7773 3.3340 3.4074 8.5326 3.1849 2.0539 1.5841 6.4193 4.9972 4.3562 7.0222 4.1621 7.0527 3.4714 4.5597 3.0524 3.7912 5.3041 3.4853 6.7843 7.5979 4.4127 5.2199 7.4444 5.0813 9.0036 2.8918 4.8516 1.1278 1.3794 9.7348 1.1314 1.3789 5.9810 1.3168 1.6279 1.6836 3.0291 1.5145 1.3290 2.5827 1.3471 2.9695 2.7825 2.9734 3.2056 2.8394 1.6868 2.4015 2.2190 2.6370 2.0808 1.2828 1.5642 1.5448 1.4939 1.3627 3.0930 1.4184 6.2402 1.2797 1.2131 1.1476 1.2734 1.1162 1.2614 1.1171 1.1045 1.3277 1.2249 7.9023 1.4737 1.5887 1.2305 9.7117 1.0800 4.0593 1.0798 1.1001 1.0459 1.0761 1.0716 2.1719 1.1197 1.0652 1.0962 7.9074 6.5213 1.0619 1.0611 1.0622 1.0592 1.0597 1.0405 1.0981 1.0919 1.0595 1.0962 1.0719 1.0962 1.1015 1.0968 1.1041 1.1024 1.1112 1.0925 1.0892 1.0950 1.0971
irintensity: 1.6674 0.7605 1.7434 1.1786 1.3462 1.9496 0.0168 0.0410 2.2178 0.0880 1.4322 3.0353 0.1458 0.1894 2.5112 8.5281 6.7328 6.5058 0.9960 3.3028 0.8989 3.7371 8.3030 8.7922 9.7205 0.9853 27.4613 15.9194 2.8606 0.1181 19.1965 27.8679 19.9061 64.8300 22.3000 8.4311 60.4882 31.4148 45.0066 173.6277 22.1645 9.6617 19.3644 9.4310 24.5403 3.7637 11.5058 291.8070 19.7508 3.0329 26.0789 176.1321 2.6186 1.3181 1.2339 0.1198 8.9661 130.1367 18.8220 26.5925 20.5865 17.3185 4.8160 19.3428 14.6374 46.1999 22.4780 15.7188 10.8928 346.6819 4.0272 360.3711 1.6156 313.2912 2.4439 2.5304 6.6072 3.6890 0.3338 0.5165 9.9685 8.5180 0.7958 8.2896 87.0841 1.1793 0.8544 16.5405 35.7451 9.7269 24.7573 8.2438 6.9967 9.5837 5.3913 3.1455 115.8125 3.4520 16.7763 22.7192 52.0556 219.3450 2.3505 30.0078 31.3164 40.8793 21.7266 16.4980 7.8609 4.0958 11.9113 2.5890 11.1444 92.4454 9.0955 29.1213 10.8830 27.0716 19.0602 4.3470 1.6728 0.9264 3.2958
temp: 298.150 k
press: 1.00000 atm
elementType: 17 15 8 8 8 8 8 7 6 6 6 6 6 6 6 6 6 6 6 6 6 6 1 1 1 1 1 1 1 1 1 1 1 1 1 1 1 1 1 1 1 1 1
symmnumber: 1
zpe: 883404.7 jmol-1
zpe.correction: 0.336471 hartree
zpe.thermalcorrener: 0.360779 hartree
zpe.thermalcorrenthalpy: 0.361723 hartree
zpe.thermalcorrgfe: 0.276976 hartree
zpe.sumelectzpe: -1776.462405 hartree
zpe.sumelectthermal: -1776.438097 hartree
zpe.sumelectthermalent: -1776.437153 hartree
zpe.sumelectthermalfe: -1776.521901 hartree
dipole: 7.7942 0.5367 4.2437
dipole: 8.8908
quadrupole: -212.2522 -137.9178 -150.1913
quadrupole: -23.7905 2.4502 -1.0740
quadrupole: -45.4651 28.8693 16.5958 -23.7905 2.4502 -1.0740
hfenergy: -1776.7988763 hartree
pointgroup: C01 [X(C14H21Cl1N1O5P1)]
dipole: 3.0358888 0.4083533 -1.6887623 debye
polarizability: 327.3992089|-7.4249001|157.9926166|-3.1112561|6.7974684|185.0721775 unknown
InChI: InChI=1S/C14H21ClNO5P/c1-2-20-22(19,12-6-4-3-5-11-15)21-14-9-7-13(8-10-14)16(17)18/h7-10H,2-6,11-12H2,1H3
charge 0 multiplicity 1
43 atoms
Cl 8.878418 -0.844796 -0.381447
P  0.592603 -0.142678 0.658282
O  0.765511 -1.861743 0.560759
O  -0.688273 0.243572 -0.520293
O  0.33255 0.308306 2.156851
O  -6.807643 0.215348 1.361457
O  -7.036366 0.352082 -0.905304
N  -6.316369 0.278666 0.167242
C  3.381492 0.264827 0.360493
C  4.541413 1.006218 -0.343452
C  2.017371 0.643252 -0.255007
C  5.923193 0.600074 0.215606
C  7.081853 1.345488 -0.480872
C  8.472253 0.966432 0.02754
C  0.82698 -2.596955 -0.738893
C  -2.070745 0.235296 -0.268524
C  -0.534107 -3.201561 -1.085527
C  -2.635065 0.175498 1.033264
C  -2.893013 0.317676 -1.4213
C  -4.034794 0.187184 1.170232
C  -4.289891 0.335157 -1.281307
C  -4.84717 0.265498 0.016784
H  3.384793 0.51042 1.440313
H  3.541041 -0.828417 0.283913
H  4.511752 0.793414 -1.432474
H  4.400654 2.101425 -0.232299
H  1.944737 0.343212 -1.315053
H  1.836861 1.731754 -0.197545
H  5.956958 0.802379 1.306006
H  6.069925 -0.49038 0.090668
H  7.03567 1.182185 -1.575039
H  6.966566 2.439504 -0.319547
H  9.272303 1.544386 -0.458802
H  8.55846 1.034307 1.123386
H  1.580746 -3.382119 -0.557669
H  1.192588 -1.931633 -1.546739
H  -0.905276 -3.812169 -0.24532
H  -1.279615 -2.420524 -1.310158
H  -0.437601 -3.855744 -1.97277
H  -1.98713 0.133032 1.914025
H  -2.420714 0.372861 -2.406044
H  -4.506291 0.14174 2.155354
H  -4.952531 0.398725 -2.148086
