program: Gaussian 09
title: 000200978
version: EM64L-G09RevD.01
frameworkgroup: C1[X(C20H27N3O)]
method: RPBEPBE
basis: SDD
operation: Freq
keyword: #p
keyword: freq=noraman
keyword: PBEPBE/SDD
title: #p freq=noraman PBEPBE/SDD
converged: YES YES NO NO
title: Mulliken charges:
elementType: O N N N C C C C C C C C C C C C C C C C C C C C H H H H H H H H H H H H H H H H H H H H H H H H H H H
charge: -0.286697 -0.081239 -0.409050 -0.129045 -0.221976 -0.062387 -0.548949 -0.132975 -0.628868 -0.454950 0.452021 -0.197621 0.399632 0.169610 -0.653161 0.231057 -0.494795 -0.459925 -0.375097 -0.211534 -0.349510 -0.389717 -0.666168 -0.652336 0.223098 0.201190 0.220593 0.250082 0.265372 0.218376 0.229972 0.206407 0.204875 0.216679 0.241997 0.188959 0.227218 0.263797 0.299778 0.225010 0.213328 0.200974 0.259417 0.216969 0.240896 0.251365 0.202393 0.214860 0.237483 0.215048 0.217543
chargesum: 0.00000
title: Mulliken charges with hydrogens summed into heavy atoms:
elementType: O N N N C C C C C C C C C C C C C C C C C C C C
charge: -0.286697 -0.081239 -0.109272 -0.129045 0.001122 0.138803 -0.078274 0.132396 -0.180519 -0.043668 0.452021 -0.197621 0.399632 0.169610 -0.005525 0.231057 -0.267576 -0.196128 -0.150087 0.001794 0.110881 0.068147 0.002449 0.017737
polarizability: 2.68573749e+02 6.61835696e+00 2.42953576e+02 2.67892414e+01 -3.02164124e+00 1.83043420e+02
1716.lowfreq: -7.9949 -7.2667 0.0003 0.0005 0.0007 8.6083 23.1885 27.2507 41.3393
frequency: 23.1493 27.1439 41.3328 54.0551 70.1417 72.5695 80.9690 119.1798 129.4952 156.1761 193.0586 209.9362 212.8991 215.5172 226.6146 234.1344 237.2829 293.7999 298.7611 318.7696 322.9778 360.3939 371.4589 388.3004 414.2563 417.1488 454.5433 472.5990 485.3499 490.3627 499.1287 511.2828 527.9708 555.8233 575.3591 596.4084 608.1353 615.1277 676.3051 680.6173 717.2409 725.0847 752.5590 768.1525 774.3596 781.0795 788.5067 800.5197 817.9074 841.9088 864.4011 882.1734 906.4635 910.0683 931.9144 943.6898 950.5610 959.5953 980.6399 1020.6095 1031.4255 1038.8705 1040.3673 1050.3116 1070.9401 1077.9395 1080.1805 1092.9139 1096.6021 1101.2513 1109.6036 1121.3426 1130.4966 1152.8012 1170.3446 1174.0190 1194.9764 1207.6960 1210.8679 1222.7112 1234.7642 1236.4511 1253.8610 1263.0456 1270.9058 1286.2245 1293.1097 1306.3368 1312.6948 1319.5664 1326.9438 1336.5272 1341.8657 1353.5436 1356.5375 1360.4178 1370.4353 1381.4620 1388.0549 1405.6458 1416.3392 1417.8385 1433.5107 1451.7420 1452.4872 1461.9057 1466.5549 1468.8253 1470.5993 1476.9786 1478.1014 1481.9279 1482.9415 1495.4518 1497.1489 1500.8710 1570.5435 1571.9387 1616.7151 1625.1609 2809.4876 2840.4754 2857.0768 2945.3529 2968.8825 2981.2655 2982.1682 2996.6465 3002.3795 3005.5123 3010.1872 3027.9588 3038.8182 3047.2362 3059.9651 3063.4795 3064.9552 3081.7302 3082.0769 3083.5832 3090.4970 3099.8592 3116.9581 3132.8177 3152.2772 3216.1616 3615.7232
redmass: 3.8673 4.2663 3.9123 2.7937 3.6495 3.5045 3.7929 4.2356 2.7599 2.8857 3.4444 3.3576 1.5721 1.4224 3.6332 1.2779 1.6861 2.8002 3.7744 2.9219 2.7475 2.9050 2.7637 2.7701 2.3532 2.3791 4.1576 3.3128 1.4681 2.8903 4.0625 3.3465 2.9780 3.8346 3.6172 4.1339 3.0507 3.9438 4.8267 5.4390 5.0512 4.7109 1.5323 1.4657 1.7382 1.2114 2.3709 2.7404 2.8911 2.4855 2.4850 1.4888 2.4245 1.9362 2.1522 2.4315 1.3168 2.7643 2.5770 2.6168 2.1486 2.2362 2.0679 2.3313 2.0596 2.0902 1.8643 1.7788 1.7674 2.8596 1.3887 2.2708 2.0516 1.6538 1.2684 1.2961 1.7336 1.8221 2.7862 1.6806 1.5010 1.5943 1.3491 1.6354 1.6965 2.1039 1.4103 1.6101 1.6642 1.3055 1.5929 1.3806 1.4013 1.3489 1.2907 1.7588 1.4352 1.2192 1.2101 2.7221 2.4782 3.3948 1.1742 4.2818 1.1443 1.1283 1.0463 1.0425 1.0985 1.0675 1.0532 1.0621 1.0847 1.0905 1.1037 2.9337 6.9203 6.3052 7.7100 7.7415 1.0807 1.0667 1.0602 1.0814 1.0695 1.0359 1.0353 1.0646 1.0642 1.0618 1.0868 1.0728 1.0863 1.0912 1.0996 1.0973 1.0988 1.0990 1.0984 1.0991 1.1017 1.1018 1.0854 1.0912 1.0982 1.0981 1.0808
irintensity: 1.2743 0.8026 0.7993 0.3959 1.1120 0.6657 0.2920 0.4907 6.4709 1.2598 3.5093 8.4809 1.0196 0.3103 1.6779 0.3237 1.4101 0.9558 1.8165 1.7187 5.7705 3.8979 5.4143 0.2771 1.9919 5.0798 2.4334 18.5765 59.2376 22.3301 5.1070 2.7474 4.7016 5.8439 7.3273 2.2491 1.3599 1.8881 6.5781 0.6297 2.7795 0.8306 73.3226 3.9324 49.0423 4.1292 2.0177 6.6408 12.6320 7.7794 2.5186 0.2698 2.5242 7.4551 3.0231 9.4929 3.0428 5.5835 7.1892 3.3581 66.3300 7.4906 7.1922 4.5441 10.9845 4.3189 6.0195 33.4316 16.8411 7.1236 3.9028 9.4729 51.6914 7.8831 3.6200 2.3966 4.3145 16.1865 21.3596 16.1798 5.5268 19.0685 6.6751 38.0080 10.9895 4.0942 0.7433 41.4562 3.8306 16.7870 18.7010 14.9393 3.9559 14.6068 7.9473 10.2775 6.4213 17.7018 23.3831 9.2144 111.3045 18.3960 6.4843 25.4031 31.4293 10.6894 2.1751 16.8949 18.5114 4.9349 9.7608 24.4498 8.3670 10.3908 14.7093 1.8657 3.0944 213.0122 10.4404 5.8981 72.5186 45.4669 205.1967 22.5651 55.4993 28.1045 19.6211 33.7789 41.9922 32.3301 22.0612 33.5628 13.4134 38.1589 16.9788 13.5002 14.4390 32.2344 55.8107 29.2740 47.3878 31.5143 4.4479 24.6546 34.0482 2.3419 59.3230
temp: 298.150 k
press: 1.00000 atm
elementType: 8 7 7 7 6 6 6 6 6 6 6 6 6 6 6 6 6 6 6 6 6 6 6 6 1 1 1 1 1 1 1 1 1 1 1 1 1 1 1 1 1 1 1 1 1 1 1 1 1 1 1
symmnumber: 1
zpe: 1144474.2 jmol-1
zpe.correction: 0.435907 hartree
zpe.thermalcorrener: 0.458345 hartree
zpe.thermalcorrenthalpy: 0.459289 hartree
zpe.thermalcorrgfe: 0.383884 hartree
zpe.sumelectzpe: -1016.020393 hartree
zpe.sumelectthermal: -1015.997955 hartree
zpe.sumelectthermalent: -1015.997011 hartree
zpe.sumelectthermalfe: -1016.072416 hartree
dipole: -1.9493 1.0777 -4.0370
dipole: 4.6107
quadrupole: -127.4811 -135.5364 -145.2567
quadrupole: 8.5608 -2.3867 -0.0470
quadrupole: 8.6103 0.5550 -9.1653 8.5608 -2.3867 -0.0470
hfenergy: -1016.4563 hartree
pointgroup: C01 [X(C20H27N3O1)]
dipole: 0.7797569 0.3031441 1.6095529 debye
polarizability: 267.9064098|-9.1227216|243.0994774|26.5854653|5.3434917|183.5648572 unknown
InChI: InChI=1S/C20H27N3O/c1-4-23(5-2)20(24)14-9-16-15-7-6-8-17-19(15)13(11-21-17)10-18(16)22(3)12-14/h6-8,11,14,16,18,21H,4-5,9-10,12H2,1-3H3
charge 0 multiplicity 1
51 atoms
O  -3.598239 -0.675746 -1.623134
N  0.199477 -1.855432 0.605454
N  4.49644 0.45536 1.144845
N  -3.731819 0.594439 0.316889
C  0.751294 -0.648676 -1.517605
C  0.947965 -1.968217 -0.679638
C  -0.754488 -0.386014 -1.749662
C  -1.505035 -0.324824 -0.401369
C  2.460482 -2.29368 -0.472189
C  -1.248835 -1.645783 0.371907
C  1.504912 0.530292 -0.88728
C  2.65316 0.200339 -0.134941
C  3.172744 -1.111971 0.136715
C  -3.013476 -0.142725 -0.621488
C  0.434675 -2.960221 1.556233
C  3.482324 1.173838 0.494403
C  1.209403 1.903548 -1.006767
C  4.304388 -0.931808 0.92625
C  3.186158 2.552375 0.373461
C  2.042374 2.888703 -0.385824
C  -5.191349 0.761737 0.105611
C  -3.151165 1.23031 1.522983
C  -6.017881 -0.344811 0.795035
C  -2.705484 2.691447 1.289616
H  1.2132 -0.849145 -2.509389
H  0.515939 -2.803868 -1.295525
H  -0.907709 0.549262 -2.31877
H  -1.195055 -1.194402 -2.361807
H  -1.081559 0.499687 0.197229
H  2.876368 -2.50844 -1.478697
H  2.589304 -3.221128 0.112743
H  -1.753727 -1.615242 1.356568
H  -1.707568 -2.486649 -0.211777
H  -0.217213 -2.81764 2.436735
H  1.477033 -2.948101 1.915332
H  0.216636 -3.973425 1.131211
H  0.339893 2.241392 -1.582452
H  4.994327 -1.658105 1.352963
H  5.254081 0.858885 1.690313
H  3.800878 3.331671 0.837152
H  1.782973 3.947248 -0.506527
H  -5.481703 1.759857 0.485316
H  -5.37487 0.734539 -0.981609
H  -3.921935 1.198515 2.316892
H  -2.301924 0.631113 1.891751
H  -5.762735 -1.328067 0.364734
H  -5.825983 -0.376068 1.883886
H  -7.099228 -0.170066 0.643808
H  -1.886518 2.739973 0.550223
H  -3.543606 3.306758 0.915391
H  -2.342626 3.139963 2.232903
