program: Gaussian 09
title: 000200905
version: EM64L-G09RevD.01
frameworkgroup: C1[X(C12H15O2P)]
method: RPBEPBE
basis: SDD
operation: Freq
keyword: #p
keyword: freq=noraman
keyword: PBEPBE/SDD
title: #p freq=noraman PBEPBE/SDD
converged: YES YES NO NO
title: Mulliken charges:
elementType: P O O C C C C C C C C C C C C H H H H H H H H H H H H H H H
charge: 1.153746 -0.506449 -0.649302 -0.838721 -0.721150 0.441995 -0.326493 -0.789786 -0.477768 0.427054 -0.376085 -0.369289 -0.226613 -0.235572 -0.232864 0.273342 0.285147 0.282799 0.272180 0.246630 0.233339 0.228030 0.229006 0.223899 0.244763 0.237717 0.284560 0.226700 0.230201 0.228986
chargesum: 0.00000
title: Mulliken charges with hydrogens summed into heavy atoms:
elementType: P O O C C C C C C C C C C C C
charge: 1.153746 -0.506449 -0.649302 -0.280233 -0.166171 0.441995 -0.079863 -0.099412 -0.009106 0.427054 -0.138368 -0.084730 0.000087 -0.005370 -0.003879
polarizability: 1.79198155e+02 -1.99283647e+01 1.36649417e+02 1.35949911e+01 2.94053900e-01 1.34420968e+02
1716.lowfreq: -11.7513 -2.9892 -0.0008 0.0011 0.0013 7.4617 23.1841 33.5636 37.1035
frequency: 22.9903 32.1138 37.0988 48.9509 114.2029 144.7147 164.9761 189.0785 215.6404 242.2692 261.7770 294.3865 326.9527 340.1391 376.2167 403.0994 422.2596 475.2684 484.7372 558.6437 587.6639 615.2058 617.8126 677.4493 704.1821 746.5989 759.7400 773.9773 813.2704 855.6067 858.4153 860.4591 880.4561 907.5139 936.0257 961.7345 966.5548 981.1822 989.4337 999.9178 1005.8265 1026.4997 1035.0087 1046.6379 1089.4228 1114.2197 1136.6866 1147.6006 1172.5136 1189.7521 1213.5277 1220.0190 1221.8760 1240.3472 1319.5717 1329.9481 1338.1082 1383.5093 1396.1331 1418.8454 1424.5660 1440.8258 1459.2716 1463.1262 1468.9985 1483.8911 1592.2093 1612.4840 1667.8497 2967.8591 3013.2904 3015.9379 3017.9115 3042.5987 3078.3443 3081.8531 3085.0658 3090.8751 3119.9078 3124.9838 3135.1301 3135.6498 3146.9574 3163.0205
redmass: 4.7210 3.5051 4.2532 3.9322 4.3187 3.7216 1.8595 1.9659 3.5659 3.3707 2.2440 6.4849 3.5984 2.3007 4.0560 2.8134 2.0335 5.6377 4.9079 5.4182 4.7496 6.0600 6.1252 4.7804 1.8416 4.5987 2.0299 1.2679 3.4822 1.5555 1.6939 2.1877 1.7100 4.6646 1.6381 1.6130 1.7374 1.4967 4.3051 1.4576 2.9726 2.2282 1.5597 1.6296 1.5283 1.1669 1.2456 1.7885 1.0547 1.1272 1.5564 2.9146 1.1357 1.6608 2.1601 1.2557 1.2021 7.9821 1.2455 1.0864 1.0868 2.1346 1.0459 1.1505 1.0648 2.1806 6.0478 5.9903 6.3950 1.0370 1.0577 1.0597 1.0580 1.0970 1.1033 1.1035 1.0989 1.1060 1.0856 1.0879 1.0937 1.0924 1.0964 1.1016
irintensity: 1.3186 0.5811 0.7153 0.5449 2.1570 14.7562 0.3218 0.1814 1.1812 11.1211 4.5463 11.4397 0.9765 11.2786 14.9227 0.0367 7.2541 21.2798 2.7970 9.2358 32.1412 19.2108 16.9069 7.2489 53.1520 30.5675 93.6544 62.1611 15.3834 6.2507 1.0465 2.5255 53.4171 162.8566 3.3795 0.2431 3.9899 4.6013 0.3534 7.5373 37.6123 2.9117 36.7483 19.8784 5.0944 8.9753 5.3878 1.0712 0.0079 0.4697 35.8279 24.3527 4.3448 4.7626 7.0519 0.6829 9.3618 0.3821 13.0546 13.3682 6.9882 9.8900 16.5018 15.6486 14.8952 6.4137 0.6915 0.1879 3.2158 36.5730 9.2495 38.6977 7.5498 20.7156 2.1762 2.5832 22.8150 7.4443 2.7598 0.6497 17.6351 11.3429 30.5319 26.1946
temp: 298.150 k
press: 1.00000 atm
elementType: 15 8 8 6 6 6 6 6 6 6 6 6 6 6 6 1 1 1 1 1 1 1 1 1 1 1 1 1 1 1
symmnumber: 1
zpe: 631193.9 jmol-1
zpe.correction: 0.240409 hartree
zpe.thermalcorrener: 0.255558 hartree
zpe.thermalcorrenthalpy: 0.256502 hartree
zpe.thermalcorrgfe: 0.196082 hartree
zpe.sumelectzpe: -956.814804 hartree
zpe.sumelectthermal: -956.799655 hartree
zpe.sumelectthermalent: -956.798710 hartree
zpe.sumelectthermalfe: -956.859131 hartree
dipole: 1.1443 3.0459 1.4263
dipole: 3.5527
quadrupole: -81.8896 -97.5298 -97.2172
quadrupole: -0.8786 2.2547 -5.9943
quadrupole: 10.3227 -5.3176 -5.0050 -0.8786 2.2547 -5.9943
hfenergy: -957.0552128 hartree
pointgroup: C01 [X(C12H15O2P1)]
dipole: 0.323126 1.2634862 -0.5028124 debye
polarizability: 177.1367798|2.0003845|135.5724842|25.7247566|1.8326947|137.559276 unknown
InChI: InChI=1S/C12H15O2P/c1-11-7-8-15(13,10-11)14-9-12-5-3-2-4-6-12/h2-7H,8-10H2,1H3
charge 0 multiplicity 1
30 atoms
P  1.351712 -0.591869 0.523479
O  0.339587 0.326607 1.642987
O  1.083746 -2.17458 0.585746
C  3.041402 0.118364 0.961709
C  1.212359 0.284754 -1.151468
C  3.412152 0.995762 -0.227179
C  2.507259 1.068207 -1.246795
C  4.737664 1.720263 -0.200697
C  -0.98874 -0.281829 1.976574
C  -1.983252 -0.169973 0.83787
C  -2.737542 1.016247 0.646316
C  -2.15906 -1.254051 -0.062488
C  -3.651185 1.120924 -0.426073
C  -3.073965 -1.150765 -1.13492
C  -3.82223 0.035794 -1.318758
H  3.758388 -0.706698 1.122555
H  2.94731 0.690544 1.90171
H  0.310817 0.921648 -1.155201
H  1.106271 -0.476418 -1.944769
H  2.697761 1.676224 -2.139322
H  4.88983 2.318526 -1.115546
H  5.580124 1.00706 -0.11097
H  4.802147 2.4005 0.670774
H  -1.301663 0.301593 2.858161
H  -0.828491 -1.338049 2.260783
H  -2.605199 1.85644 1.339116
H  -1.561474 -2.163195 0.076054
H  -4.232763 2.039674 -0.562954
H  -3.204502 -1.993884 -1.822631
H  -4.534762 0.11398 -2.147865
