program: Gaussian 09
title: 000200891
version: EM64L-G09RevD.01
frameworkgroup: C1[X(C14H19NO3)]
method: RPBEPBE
basis: SDD
operation: Freq
keyword: #p
keyword: freq=noraman
keyword: PBEPBE/SDD
title: #p freq=noraman PBEPBE/SDD
converged: YES YES NO NO
title: Mulliken charges:
elementType: O O O N C C C C C C C C C C C C C C H H H H H H H H H H H H H H H H H H H
charge: -0.272775 -0.267376 -0.264861 -0.076507 -0.441234 -0.426725 -0.444185 -0.440315 -0.360933 -0.300959 0.391659 0.281493 -0.546444 0.208794 -0.350593 -0.314957 -0.317589 -0.367425 0.214315 0.232660 0.211700 0.232430 0.217573 0.225812 0.225961 0.221230 0.205115 0.219531 0.221826 0.205571 0.270618 0.253854 0.228970 0.225478 0.227500 0.225273 0.245515
chargesum: 0.00000
title: Mulliken charges with hydrogens summed into heavy atoms:
elementType: O O O N C C C C C C C C C C C C C C
charge: -0.272775 -0.267376 -0.264861 -0.076507 0.005741 0.017406 -0.000800 0.006876 0.063714 0.126438 0.391659 0.281493 -0.275827 0.208794 -0.096739 0.139491 0.135184 -0.121910
polarizability: 2.51611529e+02 4.74695967e+00 1.48294456e+02 -4.60480105e+00 1.25346902e+00 1.10617970e+02
1716.lowfreq: -7.0850 -0.0008 -0.0006 0.0005 2.6905 8.6238 17.8901 33.8483 37.8547
frequency: 17.1215 33.6550 37.6095 48.3239 69.1802 96.5319 114.9598 136.7322 151.1162 189.4862 230.7184 236.4478 311.4029 338.4439 368.7820 379.8036 420.0094 436.5046 448.6785 463.1732 501.9305 552.0037 609.1558 613.1093 636.8915 650.8844 700.7440 713.0687 720.6701 766.4214 790.5828 824.1185 827.4565 851.4851 859.1280 864.8768 877.1199 878.5191 907.7440 916.8148 921.4862 935.7604 991.0685 1020.0589 1022.9492 1031.8375 1039.3891 1057.3557 1076.1201 1087.5203 1096.8041 1102.9266 1136.8450 1148.4670 1171.6217 1174.7183 1183.2296 1205.2167 1218.5594 1228.7801 1242.5503 1255.5748 1258.4393 1270.4644 1284.4267 1287.6268 1298.9751 1312.9338 1319.5100 1329.0964 1350.1961 1354.3431 1377.0506 1392.8821 1433.3513 1455.4307 1460.0435 1462.4366 1464.0405 1470.8177 1476.6686 1481.0777 1488.0012 1490.5704 1583.4609 1632.3085 2913.0303 2958.8207 2984.7476 2991.7751 2994.2373 3002.1328 3002.8009 3018.9315 3025.4239 3052.3479 3057.2740 3067.7529 3076.2478 3089.2356 3096.1060 3098.1215 3155.5538 3177.8166 3180.4727
redmass: 4.0986 3.4483 2.8287 2.5549 2.9868 3.6826 3.5005 2.7264 3.0484 4.9586 5.1535 3.4957 2.3778 3.7803 4.8601 2.6716 2.6824 5.0456 3.0874 5.8745 3.5344 6.2696 4.0938 2.1719 3.0588 3.3594 3.6636 4.6382 5.1958 1.7062 1.4035 1.4638 1.6266 2.5139 2.9466 1.5469 3.2386 3.4946 2.6070 3.0441 1.3661 1.5893 3.9974 3.0339 2.8374 3.1685 2.4187 2.0483 1.7962 1.9655 2.6339 3.1642 1.7490 1.7852 1.2732 1.7512 1.2054 1.1872 1.2214 1.3785 1.4149 1.3413 1.4254 3.3117 1.2494 1.1784 1.2771 1.2569 1.5293 1.3242 1.4069 1.2927 2.3200 2.0663 3.3976 1.1256 1.1591 1.0947 1.0882 1.0819 1.1184 1.3941 1.1054 1.7527 8.0985 7.5435 1.0688 1.0575 1.0660 1.0677 1.0633 1.0615 1.0595 1.0641 1.1005 1.1001 1.0986 1.1014 1.1009 1.1058 1.0980 1.1041 1.0882 1.0927 1.0946
irintensity: 0.7885 0.1547 0.4311 0.5075 2.0478 6.6448 1.0301 3.5612 1.0792 0.8381 3.6508 3.4363 7.0755 2.9675 3.1342 5.2961 1.7416 1.7645 5.2290 3.5981 7.1450 4.5803 7.4128 5.0397 13.6578 7.9060 1.0504 27.0482 8.3424 11.6731 40.9455 1.4435 1.3746 3.5404 27.3729 42.0061 14.3441 27.0336 1.3301 0.2797 3.3992 13.2772 85.5307 8.2596 22.4433 90.3813 14.8176 32.7291 16.4541 0.0984 83.0592 18.2535 5.6045 260.9177 3.4116 149.0395 0.6745 20.2436 4.3894 5.2967 9.6423 7.5334 79.5650 27.0493 6.4075 1.8173 2.6806 9.5159 10.4040 0.8668 42.3349 13.1275 15.1751 48.2341 5.0331 12.4314 11.1482 13.2407 2.4348 11.2286 41.5396 177.0680 17.8774 149.1830 18.8535 73.1250 47.7437 40.6777 55.7256 64.4496 39.2839 53.7709 43.6313 52.2907 17.6009 14.9891 39.3061 1.1960 30.7019 110.4428 40.3295 19.8439 8.1049 2.5500 5.4771
temp: 298.150 k
press: 1.00000 atm
elementType: 8 8 8 7 6 6 6 6 6 6 6 6 6 6 6 6 6 6 1 1 1 1 1 1 1 1 1 1 1 1 1 1 1 1 1 1 1
symmnumber: 1
zpe: 811171.1 jmol-1
zpe.correction: 0.308959 hartree
zpe.thermalcorrener: 0.325750 hartree
zpe.thermalcorrenthalpy: 0.326694 hartree
zpe.thermalcorrgfe: 0.261636 hartree
zpe.sumelectzpe: -823.883460 hartree
zpe.sumelectthermal: -823.866669 hartree
zpe.sumelectthermalent: -823.865725 hartree
zpe.sumelectthermalfe: -823.930783 hartree
dipole: 0.1803 -0.1301 0.5592
dipole: 0.6018
quadrupole: -74.7323 -110.1276 -107.9271
quadrupole: 3.2456 0.7039 0.4063
quadrupole: 22.8634 -12.5319 -10.3315 3.2456 0.7039 0.4063
hfenergy: -824.1924189 hartree
pointgroup: C01 [X(C14H19N1O3)]
dipole: -0.0744857 -0.0153324 0.224223 debye
polarizability: 251.1648237|5.5890951|146.1317872|7.9284668|9.4779719|113.2273432 unknown
InChI: InChI=1S/C14H19NO3/c1-2-6-15(5-1)7-8-16-12-3-4-13-14(11-12)18-10-9-17-13/h3-4,11H,1-2,5-10H2
charge 0 multiplicity 1
37 atoms
O  -0.655073 0.610322 -0.161828
O  3.971094 1.643147 0.544749
O  4.733519 -1.09083 -0.201713
N  -4.188568 -0.459545 -0.684145
C  -5.412624 0.210822 -1.207152
C  -4.680609 -1.176931 0.531851
C  -6.187144 0.73655 0.044675
C  -5.81408 -0.286135 1.166964
C  -3.04826 0.456571 -0.415222
C  -1.73349 -0.327353 -0.514596
C  0.663156 0.121143 -0.184848
C  3.011506 0.669811 0.176552
C  1.66161 1.058529 0.166471
C  3.38039 -0.659759 -0.178895
C  1.017602 -1.211725 -0.519786
C  5.297003 1.063988 0.851858
C  5.685473 0.038096 -0.217487
C  2.379219 -1.586196 -0.517058
H  -6.025364 -0.545869 -1.735361
H  -5.148731 0.998713 -1.932376
H  -3.848494 -1.370533 1.23076
H  -5.096337 -2.154891 0.22462
H  -7.275586 0.792464 -0.132298
H  -5.838318 1.751043 0.31057
H  -5.461066 0.230772 2.076269
H  -6.680454 -0.906792 1.456535
H  -3.098191 0.953865 0.580988
H  -3.040663 1.254522 -1.179001
H  -1.597667 -0.709939 -1.545004
H  -1.73228 -1.187749 0.186701
H  1.385359 2.080384 0.438784
H  0.260092 -1.95163 -0.789543
H  5.263487 0.584165 1.849422
H  5.993083 1.918044 0.870432
H  5.683456 0.509339 -1.220246
H  6.673995 -0.404463 -0.014383
H  2.680657 -2.603351 -0.785961
