program: Gaussian 09
title: 000200895
version: EM64L-G09RevD.01
frameworkgroup: C1[X(C15H22NO3)]
method: RPBEPBE
basis: SDD
operation: Freq
keyword: #p
keyword: freq=noraman
keyword: PBEPBE/SDD
title: #p freq=noraman PBEPBE/SDD
converged: YES YES NO NO
title: Mulliken charges:
elementType: O O O N C C C C C C C C C C C C C C C H H H H H H H H H H H H H H H H H H H H H H
charge: -0.329985 -0.323529 -0.244290 -0.084014 -0.347021 -0.370377 -0.476560 -0.455918 -0.373579 -0.616855 -0.316202 0.263259 0.119432 -0.374336 0.262653 -0.319002 -0.188272 -0.369148 -0.311059 0.261382 0.322269 0.279842 0.276303 0.267136 0.267610 0.269446 0.264660 0.265364 0.272639 0.256040 0.330796 0.269429 0.257209 0.248726 0.259303 0.230020 0.249413 0.251470 0.235233 0.249795 0.270715
chargesum: 1.00000
title: Mulliken charges with hydrogens summed into heavy atoms:
elementType: O O O N C C C C C C C C C C C C C C C
charge: -0.329985 -0.323529 -0.244290 -0.084014 0.236631 0.185768 0.058187 0.078189 0.164424 0.239411 0.189733 0.263259 0.119432 -0.115032 0.262653 0.160431 0.061523 -0.098433 0.175643
polarizability: 2.05980272e+02 -3.82458324e+00 1.83251891e+02 -8.55027740e+00 4.07434052e+00 1.23551655e+02
1716.lowfreq: -9.2959 -6.4133 -0.0003 0.0005 0.0007 5.6386 21.6403 42.9105 55.3749
frequency: 21.4476 42.8582 55.3039 87.7390 93.7048 105.1884 114.5064 154.6261 179.8628 197.7779 251.9293 260.9995 273.2281 314.4040 327.3407 336.6358 362.7639 388.1488 419.3470 432.5135 439.1881 469.9744 476.5934 528.0516 538.5588 590.2458 597.0962 619.2499 636.5434 658.6333 708.1166 714.6751 768.1085 788.3507 792.9769 808.7961 835.9354 861.1225 882.1500 886.0526 892.4023 893.0059 914.4445 922.1734 964.1128 968.9377 985.2525 999.0126 1012.2677 1015.3454 1053.5684 1062.6614 1068.6540 1076.6455 1080.5389 1084.7254 1102.6749 1145.3000 1163.7166 1167.9578 1180.3845 1203.2719 1212.1119 1224.3325 1230.3787 1233.8888 1235.5704 1245.5847 1256.5789 1264.6304 1293.9308 1310.4546 1321.8729 1334.8180 1351.6199 1352.2360 1355.2267 1378.5619 1385.8613 1395.7449 1445.0424 1447.3610 1451.3782 1453.4114 1460.6794 1464.4395 1469.2077 1473.9563 1477.3525 1488.0400 1492.6874 1502.3502 1516.9196 1587.8746 1609.6076 2985.6257 3007.1935 3011.9604 3017.8212 3026.5268 3034.8559 3036.1635 3046.6559 3049.2711 3054.3673 3089.7787 3099.8981 3105.6892 3107.1189 3112.5733 3118.8875 3125.3094 3140.3232 3152.1578 3158.0719 3172.3009 3186.2719
redmass: 3.8789 4.8517 3.1493 2.7740 2.0375 4.3079 3.9563 3.2098 2.9479 3.4664 5.2651 2.0245 2.4782 2.3332 2.0935 2.4583 2.3153 2.4522 2.1193 5.1650 4.2213 6.6725 3.9969 4.5739 4.1621 3.7800 5.0623 2.5476 3.1052 3.9617 2.1262 2.8590 3.4656 1.7000 1.9427 1.6628 2.6525 3.1507 2.1398 3.0283 2.3221 1.6154 2.8024 2.5243 3.6059 1.3173 1.5444 2.3178 3.2165 2.6428 3.1455 2.0411 2.6205 2.1483 1.7129 2.0058 1.8972 4.4033 1.6557 1.1448 1.3511 1.2133 1.1800 1.3705 1.2530 1.5255 1.3096 1.4168 1.4086 2.3480 1.2166 1.2642 1.3528 1.2955 1.3675 1.3315 1.3239 1.2937 6.4188 1.3854 1.1582 1.9196 1.3943 1.2456 1.5062 1.4440 1.0742 1.0702 1.0733 1.0746 1.0638 1.0933 1.0555 7.5507 7.8636 1.0606 1.0671 1.0338 1.0601 1.0608 1.0596 1.0623 1.0640 1.1017 1.0669 1.1033 1.1060 1.1048 1.1026 1.1032 1.1065 1.1065 1.1038 1.1043 1.0872 1.0926 1.0998
irintensity: 0.1296 0.9260 0.7703 2.3455 0.9900 4.2875 17.9939 3.7373 0.5049 3.2466 2.8076 0.5462 5.1461 3.2559 0.7072 2.6802 3.3477 0.3066 0.0688 5.9578 1.5715 4.2824 3.0640 0.3162 0.3511 0.3004 6.3503 1.4960 0.3403 12.3967 4.2907 23.3121 15.9397 13.8169 46.6047 8.2601 6.8349 28.4737 28.1794 2.8459 12.3663 6.7229 10.3481 20.2647 109.6545 2.0133 3.6714 16.2035 15.1533 0.7602 59.9554 61.3520 66.7917 2.2597 1.7357 1.6768 6.2243 21.9774 1.3060 5.4031 3.6700 18.5028 5.6804 4.4728 9.6271 11.7025 2.5291 10.4162 11.0477 143.4058 8.8250 7.8426 2.4468 2.0494 9.4683 11.2941 18.0746 11.4612 15.6074 0.8419 12.8910 63.0408 45.6718 5.3367 69.2799 49.4972 2.2286 31.8118 22.7775 17.2607 30.9442 1.6495 12.7748 47.1147 21.6701 28.5096 35.0278 19.7370 33.4855 8.8906 2.9881 20.4463 11.6650 9.7617 2.9562 0.8047 4.8525 3.5935 19.1878 10.9013 11.5988 17.2846 3.7796 4.3039 3.8170 2.1370 2.4642
temp: 298.150 k
press: 1.00000 atm
elementType: 8 8 8 7 6 6 6 6 6 6 6 6 6 6 6 6 6 6 6 1 1 1 1 1 1 1 1 1 1 1 1 1 1 1 1 1 1 1 1 1 1
symmnumber: 1
zpe: 924356.5 jmol-1
zpe.correction: 0.352069 hartree
zpe.thermalcorrener: 0.369729 hartree
zpe.thermalcorrenthalpy: 0.370674 hartree
zpe.thermalcorrgfe: 0.305880 hartree
zpe.sumelectzpe: -863.485064 hartree
zpe.sumelectthermal: -863.467404 hartree
zpe.sumelectthermalent: -863.466460 hartree
zpe.sumelectthermalfe: -863.531253 hartree
dipole: -10.1107 2.3706 2.0469
dipole: 10.5848
quadrupole: -54.7366 -88.2848 -102.2840
quadrupole: 2.3676 -1.2242 -0.1194
quadrupole: 27.0319 -6.5164 -20.5155 2.3676 -1.2242 -0.1194
hfenergy: -863.8371332 hartree
pointgroup: C01 [X(C15H22N1O3)]
dipole: -4.1198691 -0.4266478 -0.4319266 debye
polarizability: 204.2309069|16.3115957|126.5644809|2.7431573|-6.5955797|181.9884302 unknown
InChI: InChI=1S/C15H22NO3/c1-16(7-2-3-8-16)9-10-17-13-5-4-6-14-15(13)19-12-11-18-14/h4-6H,2-3,7-12H2,1H3
charge 1 multiplicity 1
41 atoms
O  -0.362244 0.244943 1.297957
O  0.654498 0.679858 -1.291932
O  3.526713 1.169726 -1.606163
N  -3.077616 -0.36247 0.330443
C  -2.521393 -1.691574 0.907354
C  -4.606293 -0.586998 0.412706
C  -3.453351 -2.783523 0.345238
C  -4.826068 -2.078592 0.072364
C  -2.689196 0.872862 1.165719
C  -2.647063 -0.198531 -1.123361
C  -1.258335 1.364644 0.965042
C  1.030641 0.504814 1.114448
C  1.550852 0.713071 -0.187419
C  1.879477 0.466882 2.235296
C  2.947009 0.927635 -0.3456
C  1.360292 0.548576 -2.597856
C  3.272399 0.641759 2.056478
C  3.804869 0.880182 0.773837
C  2.542015 1.518428 -2.652045
H  -2.595549 -1.606895 2.004185
H  -1.46012 -1.774048 0.640859
H  -5.107257 0.119262 -0.268314
H  -4.90065 -0.356028 1.450515
H  -3.553107 -3.603721 1.073828
H  -3.044284 -3.22426 -0.578723
H  -5.138326 -2.210871 -0.976106
H  -5.629401 -2.491989 0.702435
H  -3.391715 1.680839 0.892946
H  -2.856823 0.595076 2.220149
H  -3.074689 0.737445 -1.517167
H  -1.54752 -0.166162 -1.176391
H  -3.029993 -1.050084 -1.704241
H  -1.069405 1.718574 -0.06513
H  -1.092048 2.211655 1.660845
H  1.445789 0.293108 3.224137
H  0.606905 0.783323 -3.36635
H  1.70821 -0.495255 -2.70963
H  3.083964 1.437846 -3.606976
H  2.202751 2.561335 -2.502205
H  3.940465 0.604811 2.921614
H  4.875496 1.038149 0.616511
