program: Gaussian 09
title: 000200883
version: EM64L-G09RevD.01
frameworkgroup: C1[X(C14H21NO3)]
method: RPBEPBE
basis: SDD
operation: Freq
keyword: #p
keyword: freq=noraman
keyword: PBEPBE/SDD
title: #p freq=noraman PBEPBE/SDD
converged: YES YES NO NO
title: Mulliken charges:
elementType: O O O N C C C C C C C C C C C C C C H H H H H H H H H H H H H H H H H H H H H
charge: -0.251981 -0.241983 -0.269000 -0.110233 -0.404249 -0.324142 -0.328339 -0.290368 0.251147 0.073792 -0.671361 -0.671195 0.259194 -0.315666 -0.316183 -0.365619 -0.394430 -0.215805 0.219439 0.223067 0.204142 0.190150 0.207879 0.191185 0.222952 0.204831 0.212182 0.226100 0.206723 0.208488 0.225383 0.207866 0.228120 0.226099 0.229044 0.225536 0.254445 0.248582 0.224206
chargesum: 0.00000
title: Mulliken charges with hydrogens summed into heavy atoms:
elementType: O O O N C C C C C C C C C C C C C C
charge: -0.251981 -0.241983 -0.269000 -0.110233 0.038257 0.070150 0.070726 0.137414 0.251147 0.073792 -0.026355 -0.029459 0.259194 0.138553 0.138396 -0.111173 -0.145848 0.008401
polarizability: 2.22670340e+02 -5.90864148e+00 1.75141452e+02 -5.13551861e-01 8.63760350e+00 1.21091496e+02
1716.lowfreq: -13.4636 -2.6477 -0.0011 -0.0008 -0.0008 4.7834 18.5831 24.4564 46.0525
frequency: 16.2989 24.3895 46.0209 61.8842 77.9827 86.6834 106.0084 124.2546 141.6290 160.6968 182.4175 222.3775 234.3748 240.1848 286.9141 303.7187 307.3294 322.6199 334.7808 409.4517 431.0565 445.6533 457.8241 480.3713 512.0550 529.6362 541.3344 575.6856 629.4702 670.4162 708.1319 748.7462 762.3844 779.3303 793.6509 796.7608 814.4032 850.3710 858.9694 888.8067 901.6219 916.2926 939.3216 989.0428 1001.7390 1022.0540 1062.4186 1063.3649 1068.2730 1075.7369 1077.0544 1084.6552 1087.5496 1095.3158 1122.6250 1158.6008 1161.5785 1180.0988 1202.1956 1207.5064 1235.9437 1237.9610 1249.0404 1268.2664 1279.9043 1288.4958 1292.5746 1330.5867 1350.7814 1352.6022 1361.5663 1367.7535 1385.1964 1385.8785 1387.6903 1400.4845 1442.3801 1454.3272 1460.3259 1461.0486 1462.1583 1468.1225 1471.0058 1477.6023 1481.1880 1485.7709 1487.7709 1491.9640 1591.3533 1605.5622 2853.8902 2862.7777 2922.4244 2962.8499 2981.6418 2984.7376 2993.5385 3002.5101 3020.9994 3028.8380 3035.1643 3064.2893 3075.0535 3077.9398 3090.3399 3091.7674 3096.4145 3099.1894 3142.4999 3167.2424 3178.5308
redmass: 3.6045 4.2098 3.6951 3.8148 2.0517 2.6464 3.1494 3.1392 3.5755 1.9765 1.6927 1.3537 3.9181 2.6647 1.9883 2.5628 3.2653 3.1089 2.9682 3.4666 4.1850 4.6711 3.1502 3.5968 3.8197 5.1490 4.7306 5.0359 2.6600 6.7442 2.3518 2.8043 1.8989 4.3552 1.1288 1.2417 1.2151 1.4109 3.4059 2.9144 4.4283 1.9216 1.2857 2.3039 4.3670 3.6038 2.7080 1.6637 2.9938 1.9446 2.2990 2.1362 1.9878 2.8377 1.7188 2.6619 1.4095 1.4751 1.2004 2.2670 1.6469 1.5555 1.3448 2.9002 1.1404 1.2228 1.2213 1.3355 1.3028 1.3050 1.3341 1.3582 1.2338 1.3509 1.5928 3.7407 2.3383 1.2028 1.0616 1.2053 1.0563 1.3479 1.0610 1.5129 1.1169 1.0824 1.0954 1.0792 7.1853 7.9090 1.0719 1.0714 1.0700 1.0568 1.0356 1.0356 1.0678 1.0610 1.0877 1.1023 1.0874 1.0955 1.0981 1.0982 1.1003 1.1004 1.0990 1.1035 1.0866 1.0916 1.0983
irintensity: 0.0561 0.2314 0.1817 0.6040 0.4881 0.2404 14.0616 0.7235 0.5705 0.6921 1.1609 0.2154 0.7710 5.1916 1.8035 0.5567 3.8361 4.0415 0.8264 3.0512 3.4044 1.6836 6.8530 0.9278 18.7243 1.5224 2.2254 0.9150 1.4708 15.7862 27.7049 3.4115 65.6787 8.5275 5.7072 6.5159 1.1991 0.9299 23.9623 2.2105 4.8230 0.1248 1.3795 8.9894 124.9054 23.1843 9.8767 29.4879 168.4934 19.7946 153.3632 2.5103 2.1603 5.6874 7.7386 36.0112 7.8312 61.4238 27.6300 35.9285 17.1225 18.2249 67.4457 149.5631 2.9965 16.7359 21.4385 3.5841 16.7329 11.1582 1.4109 4.8751 20.6156 12.8293 11.5982 4.8431 107.9953 20.3383 4.6153 31.6294 12.5677 62.5313 2.4213 54.0502 19.0852 5.7880 8.0064 11.5599 76.4629 74.7846 34.0958 175.7216 59.9325 44.7865 30.8866 31.9486 56.0620 52.6396 18.2788 21.8410 17.7055 38.0131 55.8379 65.6853 35.7563 50.0857 37.4137 20.4192 9.4471 11.7904 9.0913
temp: 298.150 k
press: 1.00000 atm
elementType: 8 8 8 7 6 6 6 6 6 6 6 6 6 6 6 6 6 6 1 1 1 1 1 1 1 1 1 1 1 1 1 1 1 1 1 1 1 1 1
symmnumber: 1
zpe: 862089.2 jmol-1
zpe.correction: 0.328352 hartree
zpe.thermalcorrener: 0.347059 hartree
zpe.thermalcorrenthalpy: 0.348003 hartree
zpe.thermalcorrgfe: 0.279324 hartree
zpe.sumelectzpe: -825.054733 hartree
zpe.sumelectthermal: -825.036027 hartree
zpe.sumelectthermalent: -825.035083 hartree
zpe.sumelectthermalfe: -825.103761 hartree
dipole: -0.9160 -1.2514 -0.6530
dipole: 1.6827
quadrupole: -95.9264 -101.2182 -108.7235
quadrupole: -8.8887 -0.4568 1.4349
quadrupole: 6.0296 0.7379 -6.7675 -8.8887 -0.4568 1.4349
hfenergy: -825.3830858 hartree
pointgroup: C01 [X(C14H21N1O3)]
dipole: -0.5113701 -0.1285688 0.4002872 debye
polarizability: 214.3716962|1.5006575|120.5516894|18.6399791|7.1898163|183.9799024 unknown
InChI: InChI=1S/C14H21NO3/c1-3-15(4-2)8-9-16-12-6-5-7-13-14(12)18-11-10-17-13/h5-7H,3-4,8-11H2,1-2H3
charge 0 multiplicity 1
39 atoms
O  -0.114145 0.17034 0.391465
O  1.738983 0.238262 2.339531
O  4.583495 0.283094 1.649891
N  -3.619301 0.019823 -0.881478
C  -2.505949 0.158598 0.090573
C  -4.790222 0.881738 -0.571449
C  -3.976973 -1.401448 -1.141305
C  -1.160326 0.130873 -0.646495
C  1.218188 0.163922 -0.035772
C  2.194882 0.206754 1.000474
C  -4.536637 2.367969 -0.888079
C  -4.62331 -1.620155 -2.52272
C  3.571776 0.214266 0.66054
C  2.803068 -0.096352 3.30848
C  4.077021 0.686631 2.978155
C  1.633424 0.110493 -1.38768
C  3.987192 0.149215 -0.687606
C  3.013919 0.094491 -1.701834
H  -2.51419 -0.640203 0.866929
H  -2.591148 1.120452 0.625344
H  -5.638687 0.532039 -1.187316
H  -5.108094 0.771697 0.496419
H  -3.044953 -1.995542 -1.091621
H  -4.648003 -1.805476 -0.340978
H  -1.075381 1.00752 -1.318054
H  -1.057338 -0.793221 -1.25178
H  -3.697601 2.77666 -0.29586
H  -4.290347 2.492191 -1.957017
H  -5.434118 2.971955 -0.657102
H  -5.577697 -1.072902 -2.62321
H  -3.945119 -1.268387 -3.319632
H  -4.835742 -2.693637 -2.683856
H  3.001978 -1.185481 3.273898
H  2.397815 0.179849 4.295043
H  3.868798 1.774431 2.975891
H  4.891208 0.462567 3.686029
H  0.89442 0.077935 -2.192402
H  5.057977 0.153027 -0.90942
H  3.326639 0.046812 -2.749994
