program: Gaussian 09
title: 000200863
version: EM64L-G09RevD.01
frameworkgroup: C1[X(C8H16NO2)]
method: RPBEPBE
basis: SDD
operation: Freq
keyword: #p
keyword: freq=noraman
keyword: PBEPBE/SDD
title: #p freq=noraman PBEPBE/SDD
converged: YES YES NO NO
title: Mulliken charges:
elementType: O O N C C C C C C C C H H H H H H H H H H H H H H H H
charge: -0.157287 -0.136732 -0.096631 -0.374355 -0.488659 -0.331924 -0.333375 -0.314216 0.224711 -0.681949 -0.685319 0.285127 0.298857 0.311995 0.301877 0.284056 0.271839 0.264340 0.273850 0.300638 0.235124 0.281053 0.243326 0.245850 0.277116 0.246145 0.254541
chargesum: 1.00000
title: Mulliken charges with hydrogens summed into heavy atoms:
elementType: O O N C C C C C C C C
charge: -0.157287 -0.136732 -0.096631 0.209629 0.125214 0.223971 0.204814 0.221546 0.224711 0.088281 0.092484
polarizability: 9.96930474e+01 4.83999972e-03 8.84985212e+01 2.92693662e+00 5.32392031e+00 9.14469645e+01
1716.lowfreq: -17.4194 0.0002 0.0006 0.0009 13.8667 16.0588 56.6070 85.4172 98.9747
frequency: 56.4415 85.4010 98.8496 131.9253 204.0708 222.2601 234.2030 295.1687 311.7216 314.3101 374.9860 411.0012 421.1460 441.8464 481.9503 519.8997 545.9214 617.9723 698.4122 765.6759 783.1732 803.4585 823.1774 873.4219 903.7233 918.1810 974.5101 1001.4543 1012.1403 1028.2381 1036.0764 1075.8808 1099.4094 1109.4660 1130.3416 1161.1308 1174.2745 1213.5931 1238.9437 1266.8166 1286.5521 1316.6857 1335.9092 1350.6386 1365.5541 1373.7327 1379.8746 1412.5482 1416.5467 1453.0550 1460.7243 1469.2917 1473.7721 1476.1925 1481.1328 1482.2580 1490.2642 1496.2510 1702.2412 3005.9945 3006.8885 3018.0029 3025.7167 3030.1679 3037.2114 3054.3482 3089.2061 3091.2164 3097.6735 3099.3265 3113.4413 3117.9740 3122.1072 3128.0158 3142.4104
redmass: 3.1271 3.9311 3.1852 1.7770 2.5882 1.7698 1.0772 3.0932 1.8346 2.2461 2.7245 3.1183 2.4362 3.3849 3.4184 3.4807 2.8087 3.7632 2.8447 4.0682 1.3290 1.3978 1.9252 2.3687 3.2303 2.7633 2.0384 2.0216 2.0004 2.6022 3.6454 2.0819 2.1636 2.6432 2.2346 1.9155 1.8890 1.1989 1.2118 1.2024 1.1361 1.1491 1.3268 1.2819 1.2585 1.3100 1.2744 1.2024 1.1894 1.0758 1.0740 1.0632 1.0645 1.0573 1.0479 1.0668 1.0725 1.0664 11.4500 1.0376 1.0379 1.0680 1.0622 1.0616 1.0645 1.0601 1.1047 1.1029 1.0979 1.0975 1.1035 1.1034 1.1000 1.1077 1.1017
irintensity: 6.5080 2.4875 0.5823 1.4567 2.3905 0.2928 0.2028 3.3305 0.3525 1.0193 0.3071 1.3329 0.6849 3.5642 2.3584 0.9692 4.6160 2.3691 3.1284 5.1884 17.7173 39.1370 2.5734 28.9831 24.5412 1.6882 16.2234 25.9904 29.9880 40.4255 7.2422 1.6205 19.0584 49.7008 39.4848 7.2103 5.3175 25.2174 10.0830 29.6018 3.6479 5.5648 0.8204 4.9227 4.4976 1.7314 3.6460 32.8134 30.6799 32.0193 25.5756 17.4906 18.1846 13.7500 4.3922 13.5670 32.8489 6.4818 254.2508 1.4514 3.6354 14.7565 9.9289 4.0958 1.3657 2.0271 0.4095 0.2303 0.1348 10.0451 16.0533 18.2799 2.4422 1.7655 0.6160
temp: 298.150 k
press: 1.00000 atm
elementType: 8 8 7 6 6 6 6 6 6 6 6 1 1 1 1 1 1 1 1 1 1 1 1 1 1 1 1
symmnumber: 1
zpe: 623634.2 jmol-1
zpe.correction: 0.237530 hartree
zpe.thermalcorrener: 0.249254 hartree
zpe.thermalcorrenthalpy: 0.250198 hartree
zpe.thermalcorrgfe: 0.200346 hartree
zpe.sumelectzpe: -518.481143 hartree
zpe.sumelectthermal: -518.469419 hartree
zpe.sumelectthermalent: -518.468475 hartree
zpe.sumelectthermalfe: -518.518326 hartree
dipole: -6.6319 -1.0115 -3.4345
dipole: 7.5367
quadrupole: -64.0073 -54.2649 -56.7176
quadrupole: -2.7774 -8.1021 -1.8100
quadrupole: -5.6774 4.0650 1.6123 -2.7774 -8.1021 -1.8100
hfenergy: -518.7186725 hartree
pointgroup: C01 [X(C8H16N1O2)]
dipole: -2.6311429 0.7325649 1.1543953 debye
polarizability: 99.6875958|-0.6370198|92.4046304|-3.1490895|4.7868592|87.5463069 unknown
InChI: InChI=1S/C8H16NO2/c1-3-9(4-2)5-6-11-8(10)7-9/h3-7H2,1-2H3
charge 1 multiplicity 1
27 atoms
O  2.277304 0.691902 0.148461
O  2.5116 -1.240107 -1.089028
N  -0.645911 0.074967 0.096992
C  -0.034478 1.487393 0.32605
C  0.462973 -0.997052 0.231117
C  -1.227191 -0.014955 -1.346737
C  -1.736693 -0.178528 1.177362
C  1.318027 1.406473 1.032488
C  1.828302 -0.550603 -0.325259
C  -2.354585 0.977147 -1.643308
C  -2.394707 -1.560085 1.119196
H  -0.758131 2.089072 0.897448
H  0.113224 1.948516 -0.663263
H  0.148225 -1.903474 -0.303388
H  0.571901 -1.235052 1.303877
H  -0.365076 0.141184 -2.019122
H  -1.574157 -1.053183 -1.476852
H  -1.232595 -0.01811 2.147714
H  -2.485645 0.619662 1.047325
H  1.739625 2.414718 1.157886
H  1.275918 0.916214 2.023342
H  -2.613912 0.877921 -2.711968
H  -3.273449 0.767638 -1.070903
H  -2.064072 2.029272 -1.483541
H  -3.117869 -1.621725 1.951393
H  -2.963983 -1.725065 0.189399
H  -1.681445 -2.389743 1.256819
