program: Gaussian 09
title: 000200867
version: EM64L-G09RevD.01
frameworkgroup: C1[X(C12H20N4)]
method: RPBEPBE
basis: SDD
operation: Freq
keyword: #pfreq=noraman
keyword: PBEPBE/SDD
title: #p freq=noraman PBEPBE/SDD
converged: YES YES NO NO
title: Mulliken charges:
elementType: N N N N C C C C C C C C C C C C H H H H H H H H H H H H H H H H H H H H
charge: -0.074468 -0.410572 -0.692049 -0.020207 -0.370133 -0.356068 -0.388990 -0.395928 -0.399124 -0.373594 -0.376860 0.352589 0.213024 -0.283149 -0.438244 -0.364881 0.211627 0.168087 0.173190 0.205921 0.206040 0.193322 0.193895 0.207137 0.189555 0.216380 0.198237 0.194585 0.217727 0.230556 0.291922 0.232427 0.222560 0.230379 0.299863 0.295245
chargesum: 0.00000
title: Mulliken charges with hydrogens summed into heavy atoms:
elementType: N N N N C C C C C C C C C C C C
charge: -0.074468 -0.118650 -0.096941 -0.020207 0.009581 0.023043 0.010372 0.005104 0.006811 0.019228 0.071423 0.352589 0.213024 -0.050722 -0.215684 -0.134502
polarizability: 2.13401432e+02 -4.79231908e+00 1.62124095e+02 8.43246555e-01 6.17194199e+00 1.02631448e+02
1716.lowfreq: -22.8608 0.0007 0.0007 0.0008 1.9502 8.3480 15.5844 29.8898 47.2945
frequency: -7.6127 28.7707 47.1229 76.1499 119.0212 133.5266 180.5860 185.5349 215.4882 236.7810 281.2025 291.1083 309.5158 318.9739 376.1563 398.8654 433.4197 447.7036 449.0311 509.1137 521.8883 570.6909 572.5172 581.8680 612.3479 650.0076 744.5623 754.5531 792.1010 802.7048 806.0421 816.0624 847.5350 854.0823 864.2978 878.2466 906.7290 927.1401 957.3705 996.7053 1040.0977 1043.8801 1051.4206 1054.9704 1073.9750 1089.1589 1109.3569 1116.6783 1125.8739 1151.4571 1160.3611 1180.9688 1194.8801 1229.6543 1246.2055 1260.6757 1266.5049 1286.7909 1293.8621 1300.2814 1321.0879 1330.2723 1333.0948 1341.5201 1349.3485 1353.6420 1357.4135 1372.6911 1394.2469 1420.5315 1452.6404 1454.5008 1462.0228 1463.2423 1467.5135 1473.7402 1482.9221 1493.6854 1504.7867 1575.6028 1587.2218 1639.8444 2819.8128 2829.0875 2861.4196 2946.5633 2968.4890 2986.6952 2988.4270 2994.1869 3022.0479 3028.7008 3035.0251 3038.8531 3047.6118 3056.7833 3098.0761 3127.9980 3162.8568 3477.5378 3485.1396 3624.7060
redmass: 3.2518 4.1031 4.0698 3.4705 3.6884 2.0116 3.8711 3.0140 2.9718 1.9068 3.2223 1.8336 1.7799 2.5923 2.1801 2.4137 2.8381 2.9272 2.8891 3.1039 2.8236 1.7009 2.0044 2.5368 5.0612 1.6097 4.0785 3.5408 1.5248 2.7854 1.4210 1.3205 3.1513 1.4852 3.0165 1.5251 2.2695 1.4110 1.3002 2.4736 2.3404 2.0029 2.0020 1.7781 2.5410 2.0166 2.0960 2.1783 2.1444 1.3080 2.4210 1.4963 1.4184 1.9720 1.7297 1.2487 1.1817 1.1572 1.4462 1.8720 1.4428 1.4098 1.6090 1.4418 1.4847 1.4769 2.8640 1.4001 1.4265 2.5354 1.0954 1.5769 1.0839 1.0875 1.0953 1.0877 1.1014 1.1201 3.3649 4.9739 4.6848 1.1998 1.0716 1.0700 1.0687 1.0654 1.0627 1.0619 1.0615 1.0875 1.0880 1.0941 1.0941 1.0914 1.1033 1.1036 1.0904 1.0889 1.0952 1.0744 1.0473 1.0984
irintensity: 0.5095 0.1792 0.9014 0.8360 0.8341 0.8792 0.3059 1.5514 1.3266 0.7939 5.8637 3.7970 10.2036 6.6139 3.5334 4.6812 17.7574 11.6431 0.8768 45.0721 15.1171 111.9084 67.6848 49.3347 25.5673 145.2357 14.8567 1.9643 17.4256 5.9209 13.7808 25.9151 12.7307 10.4334 3.2419 11.2568 2.2720 0.1479 3.2570 22.0230 9.7688 9.1418 7.9758 21.6495 1.3836 6.4608 2.9824 33.2704 9.7033 5.4236 27.8777 2.2910 54.9673 18.6606 6.3346 1.7946 6.3969 2.5092 15.9550 45.6950 5.9047 2.5505 15.9668 0.5444 9.2404 2.6920 16.9429 7.5815 0.2257 6.8528 8.4191 63.1105 7.9703 6.9822 7.8111 5.3492 9.8916 45.9218 104.2349 16.3113 237.9255 102.3655 44.3405 121.5653 124.6866 57.3978 38.5727 33.3951 32.2778 8.1959 42.6349 63.4425 75.3218 35.6841 18.4779 95.4515 45.0505 17.9524 21.0431 10.3357 11.9540 18.6530
temp: 298.150 k
press: 1.00000 atm
elementType: 7 7 7 7 6 6 6 6 6 6 6 6 6 6 6 6 1 1 1 1 1 1 1 1 1 1 1 1 1 1 1 1 1 1 1 1
symmnumber: 1
zpe: 819466.9 jmol-1
zpe.correction: 0.312118 hartree
zpe.thermalcorrener: 0.326901 hartree
zpe.thermalcorrenthalpy: 0.327845 hartree
zpe.thermalcorrgfe: 0.269811 hartree
zpe.sumelectzpe: -687.027178 hartree
zpe.sumelectthermal: -687.012395 hartree
zpe.sumelectthermalent: -687.011451 hartree
zpe.sumelectthermalfe: -687.069485 hartree
dipole: -4.7025 3.5274 1.3768
dipole: 6.0375
quadrupole: -116.0228 -89.0467 -99.9935
quadrupole: 15.7752 3.3986 2.3025
quadrupole: -14.3351 12.6409 1.6941 15.7752 3.3986 2.3025
hfenergy: -687.3392963 hartree
pointgroup: C01 [X(C12H20N4)]
dipole: -1.8184888 -1.1018988 1.0588219 debye
polarizability: 211.1337777|-6.4959524|126.4858678|-14.0705601|-28.9301238|140.5373293 unknown
InChI: InChI=1S/C12H20N4/c13-11-10-14-5-4-12(11)15-6-9-16-7-2-1-3-8-16/h4-5,10,15H,1-3,6-9,13H2
charge 0 multiplicity 1
36 atoms
N  -2.628469 0.116043 0.523416
N  1.10075 -0.519997 0.356718
N  3.417002 -1.816833 1.176741
N  4.841646 0.463453 -1.446512
C  -3.61391 -0.097411 1.61594
C  -3.199562 -0.26826 -0.79507
C  -4.89313 0.730318 1.376729
C  -4.465295 0.553108 -1.113038
C  -5.519576 0.388964 0.005153
C  -1.327566 -0.533907 0.797399
C  -0.170237 0.141693 0.031639
C  2.301234 -0.184039 -0.277028
C  3.502987 -0.850324 0.144827
C  2.413267 0.769171 -1.321902
C  4.724313 -0.476407 -0.458943
C  3.685454 1.050363 -1.870463
H  -3.144144 0.203357 2.571221
H  -3.892353 -1.181786 1.705442
H  -3.456482 -1.361743 -0.811232
H  -2.438895 -0.100559 -1.578824
H  -4.629268 1.805189 1.405492
H  -5.613387 0.538211 2.195227
H  -4.876277 0.228941 -2.088504
H  -4.18366 1.619741 -1.204492
H  -5.882722 -0.659894 0.017078
H  -6.397816 1.032361 -0.191267
H  -1.126953 -0.444676 1.884486
H  -1.334061 -1.627409 0.555747
H  -0.337496 0.060571 -1.058571
H  -0.161424 1.224397 0.283158
H  1.205273 -0.856776 1.319971
H  1.535604 1.31097 -1.686238
H  5.658328 -0.958998 -0.139235
H  3.787421 1.784675 -2.677713
H  4.296868 -2.187337 1.536278
H  2.657937 -2.499771 1.114968
