program: Gaussian 09
title: 000200855
version: EM64L-G09RevD.01
frameworkgroup: C1[X(C11H14FNO)]
method: RPBEPBE
basis: SDD
operation: Freq
keyword: #p
keyword: freq=noraman
keyword: PBEPBE/SDD
title: #p freq=noraman PBEPBE/SDD
converged: YES YES NO NO
title: Mulliken charges:
elementType: F O N C C C C C C C C C C C H H H H H H H H H H H H H H
charge: -0.210448 -0.478144 -0.234646 0.180918 -0.548715 -0.096300 -0.553171 0.386479 -0.721696 -0.364706 -0.372224 -0.389896 -0.356617 0.316089 0.219981 0.255994 0.204905 0.240171 0.240505 0.249651 0.240330 0.223999 0.201898 0.338909 0.225381 0.295697 0.252515 0.253140
chargesum: 0.00000
title: Mulliken charges with hydrogens summed into heavy atoms:
elementType: F O N C C C C C C C C C C C
charge: -0.210448 -0.139234 0.015005 0.180918 -0.072740 0.108605 -0.072495 0.386479 -0.055469 -0.139324 -0.076528 -0.137380 -0.103477 0.316089
polarizability: 1.69685414e+02 1.26471246e+00 1.21281992e+02 -6.87417315e-01 -5.16958034e+00 8.38296908e+01
1716.lowfreq: -18.6578 -3.0680 0.0006 0.0008 0.0008 7.6148 31.4446 37.5272 81.6319
frequency: 29.6454 37.2367 81.6153 131.6007 191.1238 211.5351 233.2677 267.0382 283.9757 293.5220 344.8926 368.7174 392.0131 412.6696 432.2190 467.4618 472.1570 541.1780 561.2331 600.7522 629.0585 670.0668 725.3112 743.4242 787.8041 815.3903 824.2770 837.4272 862.5958 885.9734 902.3478 940.6904 959.2649 975.0050 995.1298 1007.0181 1025.1449 1078.2226 1083.8427 1104.6420 1126.8681 1132.9128 1153.7830 1156.4614 1185.4780 1198.6455 1228.3984 1251.0308 1287.8218 1303.0680 1311.5082 1340.9881 1352.2660 1379.2981 1389.3142 1402.2844 1421.9310 1448.7513 1472.6395 1473.9747 1477.1211 1494.9061 1600.2289 1613.8066 2937.4208 2974.7404 2990.7726 3001.3432 3067.9694 3076.3830 3077.8496 3092.2145 3118.8362 3165.4181 3171.3872 3190.5286 3409.6237 3565.2116
redmass: 3.4961 3.9550 4.4589 3.0047 4.2580 2.6098 1.1837 4.4726 1.3499 2.0903 5.9137 4.7692 3.8535 2.9943 2.6542 2.3499 3.0180 2.7075 4.9971 4.6772 7.2179 1.7615 3.8389 3.8821 5.4447 1.3124 2.8239 1.5146 2.6436 1.9160 1.6511 1.3554 1.9279 1.3627 1.6450 2.4656 3.3690 2.1250 2.8097 1.3694 2.8840 1.8601 1.4547 1.6676 1.5995 2.3724 1.5386 1.3144 1.2753 1.2327 1.3302 1.4885 2.1471 4.8588 1.2556 3.7095 1.1789 1.0967 1.0505 1.0848 1.0542 2.7151 7.9872 6.4996 1.0839 1.0384 1.0656 1.0618 1.0973 1.0997 1.1011 1.0999 1.0896 1.0900 1.0950 1.0954 1.0751 1.0659
irintensity: 2.7302 0.5127 1.3234 3.1166 2.8438 0.9848 0.6871 0.1378 84.0653 42.3490 7.5326 3.4968 1.3979 0.0915 3.9422 1.7039 1.0220 29.6322 24.4714 9.4270 0.1420 171.7591 2.3234 7.2208 21.2722 12.3090 19.1815 64.1780 15.8651 0.4627 1.1790 0.2407 1.0041 2.6103 33.9927 11.8816 22.4511 13.4408 21.7453 9.5428 17.8627 42.2529 42.2956 53.0477 7.7894 38.4592 4.4003 9.6665 3.0179 3.0334 0.3358 0.5291 29.3400 13.9692 17.1464 3.5588 16.4387 7.3618 10.0133 11.6356 6.9672 127.3277 7.2520 7.9977 42.8526 28.3674 44.7594 17.6815 26.7649 24.1135 32.6419 23.7217 18.2907 3.3752 4.0584 2.1254 2.0235 3.6617
temp: 298.150 k
press: 1.00000 atm
elementType: 9 8 7 6 6 6 6 6 6 6 6 6 6 6 1 1 1 1 1 1 1 1 1 1 1 1 1 1
symmnumber: 1
zpe: 599626.2 jmol-1
zpe.correction: 0.228386 hartree
zpe.thermalcorrener: 0.241515 hartree
zpe.thermalcorrenthalpy: 0.242459 hartree
zpe.thermalcorrgfe: 0.188142 hartree
zpe.sumelectzpe: -656.318471 hartree
zpe.sumelectthermal: -656.305341 hartree
zpe.sumelectthermalent: -656.304397 hartree
zpe.sumelectthermalfe: -656.358714 hartree
dipole: -3.2622 -0.9045 -0.6967
dipole: 3.4562
quadrupole: -92.6157 -76.9202 -85.9855
quadrupole: 2.1252 5.2526 -1.8127
quadrupole: -7.4419 8.2536 -0.8117 2.1252 5.2526 -1.8127
hfenergy: -656.5468563 hartree
pointgroup: C01 [X(C11H14F1N1O1)]
dipole: 1.2708329 -0.4832985 -0.0195816 debye
polarizability: 169.5782202|-2.14529|102.0292404|-1.5929329|19.4724482|103.189636 unknown
InChI: InChI=1S/C11H14FNO/c1-8-6-11(14,7-13-8)9-2-4-10(12)5-3-9/h2-5,8,13-14H,6-7H2,1H3
charge 0 multiplicity 1
28 atoms
F  -4.585351 -0.547083 -0.418698
O  1.107812 1.61813 1.332442
N  2.898145 0.278973 -1.325151
C  1.005473 0.595072 0.266327
C  1.864719 -0.65443 0.638427
C  3.245558 -0.377098 -0.026611
C  1.705495 1.128508 -1.061396
C  -0.482821 0.299448 0.10062
C  4.133034 -1.611824 -0.222961
C  -0.913276 -0.627819 -0.884892
C  -1.456348 0.940023 0.905997
C  -2.281502 -0.918082 -1.068493
C  -2.832277 0.662801 0.739747
C  -3.212916 -0.262027 -0.244853
H  1.433663 -1.571691 0.194635
H  1.900478 -0.78633 1.733869
H  3.803745 0.366843 0.583819
H  1.022336 1.127505 -1.926517
H  2.005645 2.177399 -0.873581
H  2.704431 -0.436413 -2.042582
H  5.068987 -1.341343 -0.742753
H  4.394339 -2.066907 0.748516
H  3.610122 -2.380871 -0.825289
H  2.066417 1.81583 1.484041
H  -0.177963 -1.133496 -1.523191
H  -1.122325 1.65488 1.66088
H  -2.623802 -1.630302 -1.824842
H  -3.593019 1.150102 1.356689
