program: Gaussian 09
title: 000200860
version: EM64L-G09RevD.01
frameworkgroup: C1[X(C10H10ClN7)]
method: RPBEPBE
basis: SDD
operation: Freq
keyword: #p
keyword: freq=noraman
keyword: PBEPBE/SDD
title: #p freq=noraman PBEPBE/SDD
converged: YES YES NO NO
title: Mulliken charges:
elementType: Cl N N N N N N N C C C C C C C C C C H H H H H H H H H H
charge: -0.058632 -0.106413 -0.116085 -0.087524 -0.244879 -0.615809 -0.610919 -0.579063 -0.082895 0.181604 0.169592 0.354534 0.008664 -0.275663 -0.300952 -0.218676 -0.207742 -0.237405 0.252460 0.254534 0.228392 0.234001 0.315687 0.408898 0.327195 0.342193 0.332315 0.332589
chargesum: 0.00000
title: Mulliken charges with hydrogens summed into heavy atoms:
elementType: Cl N N N N N N N C C C C C C C C C C
charge: -0.058632 -0.106413 -0.116085 -0.087524 -0.244879 0.108776 0.058469 0.085841 -0.082895 0.181604 0.169592 0.354534 0.008664 -0.275663 -0.048492 0.035859 0.020650 -0.003404
polarizability: 3.97904558e+02 1.93489798e+01 1.96429396e+02 -4.72998077e-02 3.76356947e-02 6.44804253e+01
1716.lowfreq: -0.0006 0.0014 0.0018 3.1226 4.6124 10.9513 21.1163 47.6950 65.2919
frequency: 20.9217 47.6832 65.2880 97.5496 154.6899 163.3897 201.0686 203.6765 207.7813 231.0219 303.1555 319.1601 321.3856 353.9822 384.7798 385.9836 455.0478 485.4384 489.2340 513.4878 519.9596 522.6181 545.5753 556.1728 581.8190 611.9906 617.1627 623.7765 642.3224 680.2928 682.1616 717.8501 725.4737 761.9275 795.2749 802.1941 863.8228 880.8678 921.7930 927.2605 945.7028 970.5958 982.5193 1014.4295 1031.1757 1110.2253 1131.5018 1150.5627 1165.4822 1173.5844 1198.2884 1254.5627 1278.2950 1340.3842 1369.8169 1382.3861 1423.9793 1431.7273 1445.6037 1448.3625 1481.6148 1504.7994 1552.5727 1562.6076 1577.4133 1592.1259 1596.4356 1620.7988 3110.8938 3135.3619 3153.3275 3167.4233 3176.7052 3524.7318 3556.5534 3598.7632 3689.6888 3717.3484
redmass: 6.4380 5.4774 7.4012 5.0347 5.9256 8.1792 5.0887 6.2979 7.9397 6.9770 3.4053 6.4011 3.0383 4.0468 11.4872 3.9169 3.5162 4.3767 1.2254 7.9133 1.2388 7.0072 3.2877 1.0795 4.6694 6.2524 1.0684 1.3776 6.0856 6.0501 7.0074 4.7887 5.0149 1.3661 9.1033 7.8819 1.4105 7.8184 2.7729 1.1005 1.3671 1.9829 1.3266 7.5645 1.9580 1.8134 1.9264 2.8077 1.1618 2.1683 2.7947 1.8792 4.6312 9.4443 7.0522 6.7785 2.4068 2.4059 4.1552 2.5089 2.1764 2.0994 2.4052 6.2667 3.4293 1.8792 6.4313 2.2016 1.0691 1.0859 1.0901 1.0937 1.0997 1.0440 1.0441 1.0861 1.1050 1.1059
irintensity: 0.1384 1.2228 1.1765 0.2547 0.9495 1.7103 16.6637 0.8879 0.0183 3.0130 13.0087 0.8901 6.7806 2.8838 3.5423 14.1212 14.0574 11.1547 198.4478 10.3400 227.6844 2.9173 0.0126 3.2892 11.7135 3.5361 27.8270 242.0184 2.9075 3.8422 20.0246 10.5290 0.1500 97.9911 12.7238 11.9215 0.3306 1.6397 11.2106 106.9631 7.8455 12.3411 0.4389 48.8582 7.8419 4.2706 4.3876 2.5833 2.1609 15.7209 2.4103 28.2076 73.7438 505.6912 87.2321 167.1361 32.8940 11.7568 103.5697 17.5791 100.1237 93.4345 528.1303 18.3702 769.3702 815.6495 61.6593 161.0460 103.3076 5.5986 9.3656 9.5805 24.9537 53.1478 236.3542 73.7600 70.4027 49.2256
temp: 298.150 k
press: 1.00000 atm
elementType: 17 7 7 7 7 7 7 7 6 6 6 6 6 6 6 6 6 6 1 1 1 1 1 1 1 1 1 1
symmnumber: 1
zpe: 538040.8 jmol-1
zpe.correction: 0.204929 hartree
zpe.thermalcorrener: 0.220520 hartree
zpe.thermalcorrenthalpy: 0.221464 hartree
zpe.thermalcorrgfe: 0.161186 hartree
zpe.sumelectzpe: -1229.130645 hartree
zpe.sumelectthermal: -1229.115054 hartree
zpe.sumelectthermalent: -1229.114110 hartree
zpe.sumelectthermalfe: -1229.174388 hartree
dipole: -1.3466 2.1799 -0.0204
dipole: 2.5623
quadrupole: -82.6402 -95.3031 -117.3288
quadrupole: 5.8006 0.0507 0.0654
quadrupole: 15.7838 3.1210 -18.9047 5.8006 0.0507 0.0654
hfenergy: -1229.3355738 hartree
pointgroup: C01 [X(C10H10Cl1N7)]
dipole: 0.4207409 -0.9114811 -0.0918555 debye
polarizability: 398.8216707|-4.3932232|194.082144|-16.4436009|9.188374|65.9105647 unknown
InChI: InChI=1S/C10H10ClN7/c11-5-3-1-2-4-6(5)17-18-7-8(12)15-10(14)16-9(7)13/h1-4H,12-14H2
charge 0 multiplicity 1
28 atoms
Cl -2.581217 2.895148 0.386963
N  3.306188 1.177634 -0.034509
N  3.585014 -1.267939 -0.206697
N  -0.023961 -0.591118 0.012434
N  -0.859522 0.441072 0.121725
N  1.161488 2.122389 0.134064
N  1.726803 -2.689863 -0.206065
N  5.406959 0.183477 -0.205234
C  1.321952 -0.297907 -0.032973
C  1.947641 1.018655 0.022661
C  2.235312 -1.422443 -0.150038
C  -2.23686 0.106687 0.163962
C  4.044628 0.030134 -0.145869
C  -3.175352 1.169525 0.286966
C  -2.760403 -1.218566 0.090758
C  -4.562644 0.947436 0.336717
C  -4.145133 -1.456609 0.139192
C  -5.053722 -0.376131 0.262409
H  -2.044754 -2.040242 -0.004825
H  -5.245991 1.796098 0.432051
H  -4.523164 -2.483195 0.080887
H  -6.132905 -0.556471 0.300405
H  1.607131 3.038957 0.172176
H  0.131518 1.94558 0.172419
H  2.363362 -3.47863 -0.289069
H  0.715106 -2.805248 -0.163412
H  5.994029 -0.641878 -0.290559
H  5.800694 1.119849 -0.166438
