program: Gaussian 09
title: 000200830
version: EM64L-G09RevD.01
frameworkgroup: C1[X(C7H15N2O)]
method: RPBEPBE
basis: SDD
operation: Freq
keyword: #p
keyword: freq=noraman
keyword: PBEPBE/SDD
title: #p freq=noraman PBEPBE/SDD
converged: YES YES NO NO
title: Mulliken charges:
elementType: O N N C C C C C C C H H H H H H H H H H H H H H H
charge: -0.484926 -0.102338 0.044603 -0.354581 -0.036347 -0.566767 -0.555851 -0.579678 -0.427055 -0.177638 0.274331 0.278757 0.245841 0.255070 0.256332 0.336140 0.269184 0.272413 0.274761 0.265696 0.301798 0.266758 0.266098 0.276793 0.400607
chargesum: 1.00000
title: Mulliken charges with hydrogens summed into heavy atoms:
elementType: O N N C C C C C C C
charge: -0.084318 -0.102338 0.044603 0.198507 0.209493 0.280774 0.260508 0.254573 0.115836 -0.177638
polarizability: 1.07765432e+02 5.39599929e+00 7.77501480e+01 -3.31126474e+00 -1.25025498e+00 7.09621400e+01
1716.lowfreq: -2.0722 -0.0003 -0.0002 0.0006 5.2314 17.0715 53.3315 70.6758 93.6589
frequency: 53.3008 70.5589 93.6498 148.5127 203.5256 224.7677 269.3090 278.2512 304.5828 321.4459 347.7014 362.5960 379.9756 410.1945 428.8842 435.5168 462.8220 497.0654 601.0494 728.0451 826.9666 869.6187 877.4896 927.3502 935.5644 958.7207 1024.8111 1039.4044 1053.0523 1065.1563 1115.6144 1117.9551 1178.5968 1220.6264 1226.8667 1245.9496 1259.1820 1279.7695 1318.2074 1343.4219 1370.0006 1400.3941 1417.1626 1428.5913 1430.6720 1446.1819 1452.0740 1461.5293 1470.8406 1476.3678 1483.2727 1492.6044 1508.1438 2206.8835 2978.7949 3001.1605 3022.4502 3024.0172 3026.5067 3030.0240 3065.1871 3103.4421 3137.6540 3140.4903 3143.1341 3146.0022 3154.0419 3163.0694 3533.7160
redmass: 4.8362 3.6918 5.4490 2.5422 4.3308 1.0224 3.2209 1.3780 2.1806 1.0705 2.4369 3.2201 3.6012 2.9018 1.6908 1.2943 2.3213 2.8369 3.6297 4.4349 3.3461 2.6798 2.4816 2.3527 3.1097 3.4649 2.5681 1.8832 1.2044 2.4231 1.3351 1.5228 1.2402 1.3990 1.6430 1.3309 1.7648 1.3510 1.2204 1.2501 1.2742 1.4271 1.1354 1.1857 1.0896 1.0833 1.0741 1.1068 1.0551 1.0451 1.0625 1.0523 1.0509 12.4359 1.0851 1.0591 1.0321 1.0318 1.0384 1.0531 1.1026 1.1071 1.1054 1.1056 1.1056 1.1050 1.1064 1.1063 1.0665
irintensity: 4.7459 3.3756 6.0876 1.0476 0.8187 0.0942 2.1627 1.9685 5.5026 0.5924 2.5365 0.8993 2.3498 6.1857 55.6089 123.7900 4.6440 1.3461 16.8461 0.8168 16.5038 20.2302 12.9316 27.6137 26.5386 8.2394 7.5074 4.2188 0.7491 65.2202 4.3847 10.0399 3.5295 1.0858 0.1285 34.9445 6.5199 3.5466 2.1719 10.7854 0.4552 8.2302 24.1576 15.4735 6.2695 10.6130 6.3642 11.4782 7.8420 5.6416 41.6983 38.3344 74.6352 0.7918 25.5793 1.9933 1.0440 11.2823 6.8956 6.1106 1.7104 3.6682 0.8519 2.0085 4.8957 9.7217 0.6553 6.3430 36.3435
temp: 298.150 k
press: 1.00000 atm
elementType: 8 7 7 6 6 6 6 6 6 6 1 1 1 1 1 1 1 1 1 1 1 1 1 1 1
symmnumber: 1
zpe: 575526.3 jmol-1
zpe.correction: 0.219206 hartree
zpe.thermalcorrener: 0.231174 hartree
zpe.thermalcorrenthalpy: 0.232118 hartree
zpe.thermalcorrgfe: 0.181908 hartree
zpe.sumelectzpe: -459.366216 hartree
zpe.sumelectthermal: -459.354248 hartree
zpe.sumelectthermalent: -459.353304 hartree
zpe.sumelectthermalfe: -459.403514 hartree
dipole: 8.6878 2.3682 0.1632
dipole: 9.0063
quadrupole: -49.7556 -51.0930 -53.6934
quadrupole: -2.7475 3.1104 -1.0099
quadrupole: 1.7584 0.4210 -2.1794 -2.7475 3.1104 -1.0099
hfenergy: -459.5854222 hartree
pointgroup: C01 [X(C7H15N2O1)]
dipole: -3.4433776 -0.8070664 -0.2171379 debye
dipolederiv: -0.4976852 -0.0572195 0.1140568 0.0389196 -0.7627409 -0.0400337 0.1804208 -0.0325664 -0.4918605 -0.4233311 -0.0000918 -0.0241425 0.0336834 -0.3245754 0.001433 -0.0033837 -0.0029497 -0.3293204 -0.1158564 0.0554217 0.0437545 0.0066509 -0.1795706 0.0011215 0.0024784 0.0103463 -0.1704066 0.4105717 -0.1551177 -0.087171 -0.0983003 0.1222806 0.0312726 -0.1129012 0.0124149 0.1352462 0.3453197 0.034697 -0.0483036 -0.0456941 0.6180928 -0.0504089 -0.115984 -0.0317866 0.3183875 -0.0125069 -0.0735012 -0.0027137 -0.1057486 0.2604447 -0.1166114 0.0189529 -0.0980087 0.128274 0.2264947 0.1212726 0.0495759 0.1714643 0.168557 0.0312622 0.0722679 0.0362027 0.0898283 0.0204407 -0.0166647 0.011924 -0.0191184 0.0554111 0.0276891 -0.0077469 0.0055804 0.3135379 -0.0325444 0.0345478 -0.0078621 -0.0756147 0.0926903 -0.0612753 -0.0414624 -0.0667867 0.1501804 -0.0419471 0.0321813 0.0526464 0.1128678 -0.0617649 0.018217 0.1183386 -0.0015894 -0.0498563 0.053506 -0.0172231 0.0115669 -0.0034675 -0.0398354 0.0140439 0.024249 0.0460542 0.0880754 0.0410363 0.0156444 -0.0098056 0.031048 0.0966408 0.04418 -0.0094195 0.0088714 -0.0382516 0.0468267 -0.0096156 0.008198 -0.0257691 -0.0447355 0.0395602 0.0240098 0.0682801 -0.1189665 0.1279966 0.0149907 -0.0140996 -0.0101515 0.0607739 -0.0772291 -0.0267858 -0.0156849 -0.0409039 -0.0142234 0.0672412 0.0623313 0.015562 0.090999 0.017022 0.0983105 -0.0141461 0.0641417 0.1934826 -0.0661238 -0.0008826 -0.0428864 0.0954437 0.0048935 -0.0112439 -0.016551 0.1190171 0.0866852 0.0457072 -0.0544102 -0.0052128 0.0038009 0.0557997 -0.0306028 0.0849232 0.0648508 0.007773 0.0244585 0.0155485 0.0799665 0.044816 -0.0445067 0.048851 -0.0425773 0.1077794 0.1046664 -0.0145603 0.0563962 -0.027965 0.1077591 0.0077189 0.0087715 -0.0286196 -0.0402651 0.1293881 0.0419723 -0.0251085 0.0466089 -0.0396251 0.0489892 -0.0164407 -0.0010838 0.0639909 0.0873373 -0.0688878 -0.0468014 -0.066332 0.0676532 -0.0160904 -0.0299725 0.0147416 0.0932964 -0.0449604 0.0563065 0.0465401 0.0514602 0.1154867 -0.0117814 -0.0235734 0.0054892 0.0930009 0.0612787 -0.0280625 -0.0116398 -0.0290142 -0.0184431 0.0042975 -0.001623 0.0246973 0.1139884 0.0464713 -0.0083081 -0.0439356 -0.0046938 0.1094893 0.0482781 -0.0214196 0.0112932 -0.0077949 0.1937797 -0.0290653 -0.0956625 -0.0282633 0.3609518 0.0221584 -0.1440909 0.0234556 0.3440307 unknown
polarizability: 108.0105484|3.1971003|76.1359796|4.7802423|2.8702257|72.3311922 unknown
InChI: InChI=1S/C7H15N2O/c1-9(2,3)6-7(10)4-5-8/h7,10H,4,6H2,1-3H3
charge 1 multiplicity 1
25 atoms
O  0.624991 1.240168 0.016182
N  -2.024547 -0.019002 0.016991
N  4.05043 0.071738 0.373265
C  -0.733681 -0.679473 -0.531195
C  0.583154 -0.216508 0.11504
C  -2.240439 1.357351 -0.632609
C  -3.20502 -0.923143 -0.34923
C  -1.973321 0.143558 1.535836
C  1.777691 -0.88892 -0.631687
C  3.048743 -0.383481 -0.086878
H  -0.843967 -1.766956 -0.376889
H  -0.723959 -0.469317 -1.614425
H  0.625471 -0.530717 1.178705
H  -2.412172 1.214003 -1.710827
H  -3.125253 1.822491 -0.171222
H  -1.337466 1.959473 -0.466434
H  -3.125736 -1.870463 0.206006
H  -4.14195 -0.411391 -0.081704
H  -3.187041 -1.118685 -1.432417
H  -1.745282 -0.827932 2.001091
H  -1.204159 0.887311 1.787111
H  -2.958213 0.49484 1.879679
H  1.741497 -1.98912 -0.518718
H  1.736164 -0.653986 -1.712068
H  1.504567 1.589264 0.317996
