program: Gaussian 09
title: 000200824
version: EM64L-G09RevD.01
frameworkgroup: C1[X(C8H18N4O2S)]
method: RPBEPBE
basis: SDD
operation: Freq
keyword: #p
keyword: freq=noraman
keyword: PBEPBE/SDD
title: #p freq=noraman PBEPBE/SDD
converged: YES YES NO NO
title: Mulliken charges:
elementType: S O O N N N N C C C C C C C C H H H H H H H H H H H H H H H H H H
charge: 0.947931 -0.575293 -0.586068 -0.121173 -0.098378 -0.633919 -0.657441 -0.371385 -0.375577 -0.554871 -0.410944 -0.569750 -0.380523 -0.433378 0.210885 0.234817 0.253265 0.212917 0.218962 0.278338 0.266612 0.233463 0.270327 0.268595 0.285283 0.215864 0.216543 0.191306 0.200002 0.321203 0.294316 0.311832 0.336239
chargesum: 0.00000
title: Mulliken charges with hydrogens summed into heavy atoms:
elementType: S O O N N N N C C C C C C C C
charge: 0.947931 -0.575293 -0.586068 -0.121173 -0.098378 -0.018400 -0.009370 0.116697 0.056302 -0.009921 0.092846 -0.015872 0.051884 -0.042070 0.210885
polarizability: 1.82101795e+02 -1.79744760e+00 1.35994862e+02 -1.69749785e+00 4.47462347e+00 1.27194349e+02
1716.lowfreq: -19.9206 -7.2067 0.0013 0.0014 0.0020 3.1450 15.2357 23.2890 40.0559
frequency: 12.7480 22.9091 39.9792 63.0852 73.0653 104.9895 139.3013 190.8210 201.6234 220.7649 229.1859 241.8594 253.1352 289.0200 303.5701 321.7319 350.6514 364.8991 380.0439 402.6980 420.0875 431.1560 458.8457 473.3827 489.8732 543.1179 556.0160 575.1799 581.2148 679.9069 732.3337 779.6171 781.6657 816.7376 869.9455 886.9025 890.8648 904.1326 934.2540 945.1240 999.6955 1006.7836 1028.2316 1029.4668 1049.4865 1064.8799 1084.3499 1100.9896 1139.2509 1147.9468 1170.6915 1182.2695 1191.3140 1223.3546 1252.0480 1256.5542 1275.3614 1292.3166 1301.9282 1327.4485 1342.1145 1356.9943 1371.5387 1378.2275 1397.8404 1400.4424 1413.8471 1450.9479 1454.8203 1467.7080 1475.0957 1478.1874 1601.6921 1615.7531 1669.8818 2870.4784 2874.4462 2917.3279 2935.1052 2955.0580 2980.1947 3010.4742 3015.9623 3036.2831 3039.7746 3049.3438 3052.7007 3141.1200 3142.7584 3527.7253 3553.6549 3675.7846 3699.1215
redmass: 6.0787 4.2001 3.8727 2.8455 4.4409 4.1236 3.2147 4.9164 3.4816 2.7104 2.8474 2.9645 3.5319 3.8482 3.8301 3.2607 2.0909 1.7474 2.6208 1.2625 1.8230 1.3404 4.8682 2.1345 2.5646 2.3293 1.5220 2.3513 4.6992 5.5985 2.7041 3.6130 1.4583 1.6613 2.2819 1.9548 4.2297 5.0428 2.0804 2.9493 2.5044 1.9186 1.6648 1.6679 1.8127 3.1246 1.7793 1.8101 1.1659 1.6742 1.3546 2.0796 1.2795 1.4540 1.3354 1.4240 1.2350 1.3092 1.2961 1.4000 1.3436 1.3422 1.4006 1.3227 1.1273 1.1402 4.3551 1.0715 1.0829 1.0868 1.0705 1.0892 1.2368 1.2887 3.5530 1.0571 1.0709 1.0914 1.0759 1.0601 1.0626 1.1010 1.0915 1.0883 1.0583 1.0642 1.0946 1.1089 1.1093 1.0450 1.0453 1.1021 1.1032
irintensity: 1.9095 3.1560 0.6999 4.8287 5.1522 2.4398 2.4544 1.3662 4.9567 12.4496 2.1087 0.4199 11.2080 13.0314 20.0960 23.9187 13.9627 66.9323 20.7504 250.3217 16.3544 43.5563 4.7524 17.0336 4.5956 40.4947 180.0245 59.2764 24.2117 71.2833 4.0857 46.3029 15.8808 12.1421 0.7140 38.9008 27.2270 49.6370 1.2239 29.3133 14.5624 7.9490 9.5256 8.8521 13.3766 18.0148 2.2756 40.0745 2.9415 31.7523 6.7788 2.9435 8.9194 17.4207 13.7062 1.1730 2.2780 10.2679 57.1652 8.8180 7.8091 2.4419 3.8496 14.1160 5.7473 14.6636 124.5913 10.0957 12.4250 11.8492 32.4221 9.8085 132.4375 90.8026 622.7196 96.3623 102.2618 22.9468 99.1844 44.3353 22.4553 6.7242 16.5772 15.6123 4.7658 10.5814 32.9647 1.0694 5.9367 25.9376 17.4754 21.8899 22.5919
temp: 298.150 k
press: 1.00000 atm
elementType: 16 8 8 7 7 7 7 6 6 6 6 6 6 6 6 1 1 1 1 1 1 1 1 1 1 1 1 1 1 1 1 1 1
symmnumber: 1
zpe: 714369.2 jmol-1
zpe.correction: 0.272089 hartree
zpe.thermalcorrener: 0.289649 hartree
zpe.thermalcorrenthalpy: 0.290593 hartree
zpe.thermalcorrgfe: 0.224665 hartree
zpe.sumelectzpe: -1081.769174 hartree
zpe.sumelectthermal: -1081.751614 hartree
zpe.sumelectthermalent: -1081.750670 hartree
zpe.sumelectthermalfe: -1081.816598 hartree
dipole: -8.0325 -1.1071 1.8159
dipole: 8.3092
quadrupole: -110.8834 -103.4628 -89.6555
quadrupole: -20.3017 -0.1533 5.2263
quadrupole: -9.5495 -2.1289 11.6784 -20.3017 -0.1533 5.2263
hfenergy: -1082.0412634 hartree
pointgroup: C01 [X(C8H18N4O2S1)]
dipole: -3.15991 -0.5623788 -0.6211133 debye
polarizability: 182.1335879|1.8765433|129.9884976|-1.0800492|-6.0558739|133.1689209 unknown
InChI: InChI=1S/C8H18N4O2S/c9-8(10)11-2-4-12-3-1-6-15(13,14)7-5-12/h1-7,9-10H2
charge 0 multiplicity 1
33 atoms
S  3.123928 -0.092186 0.932279
O  3.350759 -0.316612 2.536854
O  4.394705 0.097251 -0.095276
N  0.371174 0.39448 -0.849558
N  -3.322808 0.516466 -0.054163
N  -5.632012 0.236073 0.271083
N  -4.183103 -1.1978 1.437243
C  1.397465 1.447068 -0.733645
C  0.695047 -0.758852 -1.71222
C  2.026244 1.482475 0.667342
C  1.973154 -1.520148 -1.269165
C  2.119349 -1.633879 0.247271
C  -1.045885 0.821623 -0.880849
C  -1.944067 0.016905 0.08709
C  -4.303238 -0.125739 0.5386
H  0.958432 2.447986 -0.923599
H  2.202726 1.320227 -1.48624
H  0.807703 -0.470534 -2.786358
H  -0.167976 -1.448655 -1.659539
H  2.7609 2.2935 0.811846
H  1.282301 1.446717 1.477347
H  1.95068 -2.536595 -1.708115
H  2.891822 -1.043991 -1.667599
H  1.176445 -1.61106 0.813526
H  2.776749 -2.455423 0.577634
H  -1.483787 0.746903 -1.901667
H  -1.116028 1.885028 -0.589267
H  -1.857512 -1.073155 -0.144865
H  -1.540941 0.15723 1.117478
H  -5.741536 0.975097 -0.421473
H  -6.328855 0.175238 1.011994
H  -4.956452 -1.84198 1.584989
H  -3.264887 -1.461156 1.782025
