program: Gaussian 09
title: 000200838
version: EM64L-G09RevD.01
frameworkgroup: C1[X(C16H24N2)]
method: RPBEPBE
basis: SDD
operation: Freq
keyword: #pfreq=noraman
keyword: PBEPBE/SDD
title: #p freq=noraman PBEPBE/SDD
converged: YES YES NO NO
title: Mulliken charges:
elementType: N N C C C C C C C C C C C C C C C C H H H H H H H H H H H H H H H H H H H H H H H H
charge: -0.077154 -0.018206 0.255678 -0.084580 -0.485482 -0.409066 0.399339 -0.387685 -0.773657 -0.297646 -0.722639 -0.382408 -0.398222 -0.242281 -0.261878 -0.619824 -0.625682 -0.241715 0.197263 0.245154 0.232335 0.235959 0.210969 0.253423 0.182269 0.222415 0.236292 0.243989 0.227697 0.220508 0.205766 0.254955 0.236197 0.229127 0.227515 0.184828 0.230777 0.223528 0.232201 0.184465 0.224119 0.231359
chargesum: 0.00000
title: Mulliken charges with hydrogens summed into heavy atoms:
elementType: N N C C C C C C C C C C C C C C C C
charge: -0.077154 -0.018206 0.255678 0.112683 -0.007993 0.037862 0.399339 0.048007 -0.070962 -0.297646 -0.068669 -0.127453 -0.162025 -0.013154 -0.034363 0.019309 0.015103 -0.010356
polarizability: 1.93219467e+02 -2.04249951e+01 1.72917032e+02 3.62758593e+00 1.25870766e+01 1.69589254e+02
1716.lowfreq: -17.4466 -9.8168 -0.0005 0.0004 0.0006 6.6304 24.3192 33.2757 45.6651
frequency: 23.6925 33.2244 45.5539 62.8957 75.1791 88.6582 106.3801 116.7912 133.4132 144.0426 193.1688 195.3674 211.5448 228.3276 242.1616 247.5944 256.5020 276.3752 303.6106 326.2532 341.1242 364.2362 403.5606 407.6366 413.4379 446.5019 455.8349 477.5433 522.2596 616.8725 625.0804 640.6228 687.7432 707.0849 763.2354 773.1768 781.1032 818.2465 831.2066 856.5410 899.8977 921.0660 948.2622 975.5117 977.1155 982.1378 991.2041 997.7388 1017.8206 1026.0773 1031.0409 1032.9377 1045.4156 1069.1628 1071.2628 1085.4185 1092.2782 1124.8175 1137.3599 1150.1600 1155.8193 1168.5281 1175.4605 1198.7123 1212.0321 1253.3803 1264.5852 1270.3977 1284.6574 1309.0377 1311.7802 1322.7680 1328.8776 1348.3566 1376.0151 1379.4863 1386.7749 1398.3471 1419.2974 1435.0064 1442.4385 1461.6224 1462.7829 1467.7884 1472.3637 1473.0838 1477.3944 1481.0845 1481.4786 1484.2249 1485.6356 1489.6358 1496.2865 1590.0905 1610.9023 2176.5092 2827.6454 2840.8663 2858.6132 2975.6667 2976.9126 2983.9170 2987.5946 3012.7906 3020.6859 3029.9308 3033.7967 3035.2288 3067.5300 3072.8665 3079.3652 3079.8273 3082.4098 3086.6425 3091.8356 3123.6487 3128.8275 3140.9503 3149.1722 3165.3095
redmass: 3.2957 2.8598 3.2895 2.8159 3.6991 2.4068 4.0677 2.5975 5.9429 3.0891 1.4690 1.5902 2.1609 1.3194 1.5790 1.2809 2.6004 2.8176 2.6246 2.3702 2.7202 3.2981 2.8596 3.3364 2.8782 3.3470 3.1817 3.6322 3.6754 6.1859 4.2694 4.5063 3.7468 1.6813 1.4848 1.9883 1.2539 4.0155 1.9303 1.2521 2.1615 1.4920 1.7382 1.8232 1.7486 1.3791 5.7537 1.3254 2.5561 2.2866 2.0719 1.8457 2.5773 2.4594 2.1284 1.6594 1.3619 1.7105 2.0100 2.1691 2.0380 1.9788 1.0572 1.2694 2.2243 1.8611 1.8907 1.2614 1.3435 1.1740 1.4323 1.2920 1.3290 1.4449 3.0116 1.7642 1.2152 1.2027 1.1421 2.2459 1.1666 1.0563 1.0616 1.0669 1.0468 1.0797 1.0513 1.0523 1.0665 1.9480 1.0827 1.0823 1.0459 5.9829 5.9907 12.6645 1.0695 1.0576 1.0581 1.0390 1.0636 1.0707 1.0424 1.0601 1.0719 1.0717 1.0997 1.0851 1.0988 1.1026 1.0989 1.1007 1.0994 1.1006 1.0985 1.0845 1.0875 1.0917 1.0959 1.1015
irintensity: 0.3799 0.4134 0.0784 0.0939 0.6427 0.0666 0.5167 0.6305 4.2176 1.0335 0.6444 1.2583 1.0904 0.8666 0.3538 1.2877 0.1798 0.1411 1.0532 0.2081 8.3425 1.3716 0.0896 0.6039 1.2213 0.1172 0.9338 0.3586 5.6354 1.5539 15.5463 1.1596 1.7860 60.2659 9.9864 27.9645 9.7732 14.7951 0.9731 0.1399 1.4825 0.9468 6.0118 9.0356 0.9873 1.6543 1.6907 0.2825 9.6600 24.0172 8.3171 21.6556 17.0614 23.0651 4.6807 8.0564 4.2652 10.5898 2.2601 0.5311 7.1536 3.6569 0.0909 0.8591 9.3021 4.1800 3.4839 0.4320 1.0776 12.8000 3.0326 2.7100 3.4394 0.7493 0.7393 2.7101 8.8647 24.1169 5.0861 10.3389 1.7831 12.0815 17.6275 1.2637 9.1326 4.0983 19.2650 12.2904 14.3727 26.1791 15.8898 6.6460 5.1932 1.0009 7.2726 10.9084 75.2438 69.0693 215.8179 37.2624 12.2606 22.5507 20.4496 8.4552 40.2586 49.9561 16.5655 7.0213 47.3572 18.8066 33.9737 26.5239 71.2746 40.9390 29.1352 2.9304 0.3655 14.1641 34.2212 21.4116
temp: 298.150 k
press: 1.00000 atm
elementType: 7 7 6 6 6 6 6 6 6 6 6 6 6 6 6 6 6 6 1 1 1 1 1 1 1 1 1 1 1 1 1 1 1 1 1 1 1 1 1 1 1 1
symmnumber: 1
zpe: 952377.9 jmol-1
zpe.correction: 0.362742 hartree
zpe.thermalcorrener: 0.382922 hartree
zpe.thermalcorrenthalpy: 0.383867 hartree
zpe.thermalcorrgfe: 0.313375 hartree
zpe.sumelectzpe: -732.179351 hartree
zpe.sumelectthermal: -732.159170 hartree
zpe.sumelectthermalent: -732.158226 hartree
zpe.sumelectthermalfe: -732.228718 hartree
dipole: -1.3907 -2.0468 -3.8461
dipole: 4.5734
quadrupole: -102.5589 -115.2347 -117.0996
quadrupole: -5.7281 -1.6527 -5.4114
quadrupole: 9.0722 -3.6036 -5.4685 -5.7281 -1.6527 -5.4114
hfenergy: -732.5420926 hartree
pointgroup: C01 [X(C16H24N2)]
dipole: 0.5184388 -0.8709433 1.4866906 debye
polarizability: 195.1320103|19.2126304|171.7422932|3.3907614|-12.8092247|168.8514489 unknown
InChI: InChI=1S/C16H24N2/c1-5-14(2)16(13-17,11-12-18(3)4)15-9-7-6-8-10-15/h6-10,14H,5,11-12H2,1-4H3
charge 0 multiplicity 1
42 atoms
N  2.480983 -2.322876 -0.329268
N  -0.4871 2.263088 -2.531906
C  -0.030146 0.709256 -0.396731
C  0.505046 1.654281 0.76199
C  1.048797 -0.345719 -0.882365
C  1.855213 2.328428 0.391544
C  -1.324571 -0.057503 -0.004754
C  1.596421 -1.270364 0.225168
C  -0.560779 2.701875 1.163778
C  -0.307534 1.56991 -1.577051
C  2.460044 3.175752 1.533185
C  -2.292431 -0.373517 -0.992546
C  -1.53269 -0.537983 1.314257
C  -3.43258 -1.143594 -0.675481
C  -2.673461 -1.307158 1.634969
C  2.663114 -3.444701 0.615726
C  3.777528 -1.802681 -0.810129
C  -3.629247 -1.616424 0.64149
H  0.699579 1.001074 1.636772
H  0.582345 -0.985069 -1.653451
H  1.872861 0.200605 -1.374324
H  1.712195 2.964589 -0.504685
H  2.592616 1.551339 0.113686
H  0.746275 -1.774932 0.718549
H  2.125923 -0.669118 1.010685
H  -0.244985 3.257489 2.063404
H  -0.718636 3.43439 0.350105
H  -1.532698 2.229646 1.387237
H  1.846282 4.064878 1.76026
H  3.469037 3.532619 1.257062
H  2.556813 2.583405 2.463639
H  -2.160613 -0.006225 -2.016917
H  -0.815511 -0.306522 2.108902
H  -4.167014 -1.369993 -1.456394
H  -2.814126 -1.662378 2.662081
H  3.187556 -3.151557 1.561648
H  1.679185 -3.867418 0.885649
H  3.256152 -4.242371 0.133525
H  3.62552 -1.059958 -1.611327
H  4.383883 -1.321971 0.001316
H  4.370858 -2.632026 -1.234051
H  -4.514402 -2.212066 0.890354
