program: Gaussian 09
title: 000200822
version: EM64L-G09RevD.01
frameworkgroup: C1[X(C11H24N4)]
method: RPBEPBE
basis: SDD
operation: Freq
keyword: #pfreq=noraman
keyword: PBEPBE/SDD
title: #p freq=noraman PBEPBE/SDD
converged: NO YES NO NO
title: Mulliken charges:
elementType: N N N N C C C C C C C C C C C H H H H H H H H H H H H H H H H H H H H H H H H
charge: -0.179873 -0.121747 -0.633379 -0.689123 -0.029416 -0.023694 -0.446705 -0.387851 -0.400452 -0.410938 -0.740762 -0.744504 -0.370989 -0.473054 0.206473 0.189158 0.204924 0.193806 0.193846 0.201880 0.194256 0.193730 0.226025 0.202937 0.213074 0.217923 0.220468 0.211504 0.214300 0.210008 0.214347 0.236047 0.198651 0.193002 0.211665 0.312322 0.282016 0.276378 0.433745
chargesum: 0.00000
title: Mulliken charges with hydrogens summed into heavy atoms:
elementType: N N N N C C C C C C C C C C C
charge: -0.179873 -0.121747 -0.039040 0.021000 0.159742 0.181230 -0.059054 0.008285 0.019303 0.005074 -0.090866 -0.105848 0.063709 -0.068387 0.206473
polarizability: 1.78011435e+02 -5.98418868e+00 1.48331719e+02 -1.21491639e+00 -6.11273476e+00 1.16917386e+02
1716.lowfreq: -7.2409 -2.7438 -0.0006 0.0005 0.0007 5.5352 33.9016 47.7728 74.4639
frequency: 33.8530 47.4437 74.4435 116.1623 137.4219 150.6995 180.4095 203.1056 214.2713 217.5775 236.9723 255.2949 273.4629 277.1647 307.5755 344.9305 377.3067 379.9231 416.0202 418.8535 429.0766 449.7073 459.5726 498.0985 549.6912 561.2600 603.8945 611.4006 679.0693 733.2840 759.1343 800.3163 803.2735 853.1841 889.2762 911.9060 924.0086 936.9824 947.4397 964.5831 976.9665 977.9216 1006.4738 1021.5865 1037.8451 1041.8334 1054.8625 1080.0352 1084.8958 1096.4276 1120.9671 1133.4401 1170.2195 1180.4161 1188.0938 1203.1190 1233.1633 1263.2661 1276.1980 1281.2298 1286.4596 1302.8776 1314.0110 1329.6822 1336.6660 1341.8357 1349.8805 1351.3323 1361.9779 1368.9144 1381.2371 1388.1519 1394.2480 1428.4757 1450.5505 1453.3543 1455.2113 1462.6162 1469.8007 1476.6587 1477.5439 1484.9161 1487.8858 1491.6353 1592.4861 1605.3688 1676.1064 2878.4866 2891.6259 2901.8518 2936.7860 2939.5785 2946.0932 2957.2113 2961.3732 2963.7778 2967.7359 2981.1398 2997.5040 3004.3397 3015.2768 3020.4776 3036.0250 3043.2502 3060.1141 3067.2745 3069.1266 3085.5481 3518.2223 3585.4847 3669.1527
redmass: 3.6519 3.7468 3.9824 3.3177 2.6906 3.7819 2.2169 2.6547 1.1332 1.2518 2.6727 2.3881 2.4320 3.1835 2.0575 2.7245 1.4272 1.9437 1.6483 1.2210 2.3005 2.5372 2.1593 2.2185 2.2078 1.3880 2.7952 2.6553 5.5448 2.8372 2.7029 2.6419 3.1621 1.6356 2.2071 1.9140 2.1079 1.8926 1.5656 1.5203 1.2697 2.0568 1.6344 1.7845 1.8778 2.0451 2.3249 2.4607 2.2092 1.6269 1.7776 2.0421 2.0129 1.8579 2.0021 1.4563 1.1399 1.2891 1.3846 1.1762 1.3373 1.4262 1.2378 1.3943 1.3114 1.4686 1.3648 1.2879 1.3343 1.3769 1.2579 1.2215 1.2711 4.4029 1.0851 1.1021 1.0946 1.0890 1.0580 1.0519 1.0560 1.0609 1.0769 1.0711 1.6175 1.3039 1.8145 1.0702 1.0682 1.0714 1.0695 1.0752 1.0812 1.0739 1.0703 1.0555 1.0446 1.0372 1.0903 1.0994 1.0905 1.1015 1.0919 1.0912 1.0989 1.0994 1.0995 1.0978 1.0447 1.0825 1.1018
irintensity: 0.1768 0.1002 1.7510 1.4203 1.3471 9.7585 1.3441 11.0297 1.7202 1.3697 3.8546 8.3902 2.9270 3.5992 0.6825 4.3214 66.8986 24.9966 6.6558 125.0217 14.1002 15.4585 13.9901 52.4734 57.6525 161.7680 2.5496 11.0470 39.8571 17.8651 3.3108 2.0311 2.1724 6.9585 13.0903 4.2001 6.8596 7.0007 5.2576 26.3548 38.2820 1.4085 17.1442 1.9196 10.4530 13.7350 1.5664 2.9008 32.5573 2.5402 13.8356 1.2440 14.5713 1.6650 9.2574 1.0786 4.1712 1.3305 4.8214 8.4827 1.5704 4.1542 17.3782 10.9940 5.5938 7.1619 13.9191 6.2099 3.5037 5.0287 8.6996 10.5561 13.1706 231.4268 3.6680 36.3190 2.3999 7.6614 1.9797 13.8992 10.3697 5.3583 14.8971 16.2282 70.8734 113.0899 322.0504 222.2651 84.6926 191.4385 4.9687 566.7494 8.8261 74.7155 171.9380 43.1141 51.2940 33.3230 48.5290 44.1044 62.5230 50.6632 33.7891 32.2629 56.2850 35.7048 50.5360 44.7422 13.2736 19.2471 16.6344
temp: 298.150 k
press: 1.00000 atm
elementType: 7 7 7 7 6 6 6 6 6 6 6 6 6 6 6 1 1 1 1 1 1 1 1 1 1 1 1 1 1 1 1 1 1 1 1 1 1 1 1
symmnumber: 1
zpe: 917980.5 jmol-1
zpe.correction: 0.349640 hartree
zpe.thermalcorrener: 0.366329 hartree
zpe.thermalcorrenthalpy: 0.367274 hartree
zpe.thermalcorrgfe: 0.306423 hartree
zpe.sumelectzpe: -651.324366 hartree
zpe.sumelectthermal: -651.307677 hartree
zpe.sumelectthermalent: -651.306733 hartree
zpe.sumelectthermalfe: -651.367583 hartree
dipole: 3.0641 2.0250 -0.1164
dipole: 3.6746
quadrupole: -100.2858 -89.3511 -94.5335
quadrupole: -10.5993 0.1890 -0.0054
quadrupole: -5.5624 5.3724 0.1899 -10.5993 0.1890 -0.0054
hfenergy: -651.6740067 hartree
pointgroup: C01 [X(C11H24N4)]
dipole: 1.1542043 -0.5313047 -0.6896298 debye
polarizability: 171.954252|-16.2078944|125.0184051|11.1362428|8.304053|146.2878829 unknown
InChI: InChI=1S/C11H24N4/c1-9-3-5-15(8-10(2)7-9)6-4-14-11(12)13/h9-10H,3-8,12-13H2,1-2H3
charge 0 multiplicity 1
39 atoms
N  -0.155508 0.446228 0.343504
N  -3.358999 1.442032 0.6431
N  -4.658708 0.838359 -1.210253
N  -2.54345 -0.186487 -0.96245
C  1.681423 0.122686 -1.470863
C  2.776388 -1.29982 0.489027
C  2.960053 -0.372406 -0.738387
C  1.847004 -0.693369 1.573223
C  0.811822 1.073689 -0.607228
C  0.344896 -0.685627 1.18808
C  0.870773 -1.008929 -2.146547
C  4.159463 -1.648972 1.088838
C  -0.838663 1.504468 1.164495
C  -2.283441 1.126961 1.605217
C  -3.476741 0.718753 -0.456069
H  2.056173 0.773249 -2.291145
H  2.306119 -2.248112 0.148216
H  3.530841 0.522159 -0.406834
H  3.604629 -0.89448 -1.476131
H  2.187196 0.328448 1.841932
H  1.948724 -1.304435 2.493169
H  1.50086 1.772438 -0.072505
H  0.196418 1.697026 -1.286083
H  0.117587 -1.645977 0.680249
H  -0.265564 -0.681969 2.109565
H  0.482177 -1.737075 -1.414008
H  0.006847 -0.59418 -2.698305
H  1.504458 -1.561907 -2.864899
H  4.828295 -2.090664 0.326439
H  4.65615 -0.741978 1.485226
H  4.06671 -2.372809 1.920049
H  -0.903548 2.427542 0.559272
H  -0.224202 1.746236 2.064019
H  -2.292135 0.047781 1.891886
H  -2.505098 1.70326 2.523682
H  -5.357133 1.460538 -0.805718
H  -4.610765 0.776222 -2.226446
H  -2.83905 -0.923499 -1.601023
H  -1.566301 -0.137275 -0.57119
