program: Gaussian 09
title: 000200809
version: EM64L-G09RevD.01
frameworkgroup: C1[X(C12H25NO)]
method: RPBEPBE
basis: SDD
operation: Freq
keyword: #p
keyword: freq=noraman
keyword: PBEPBE/SDD
title: #p freq=noraman PBEPBE/SDD
converged: YES YES NO NO
title: Mulliken charges:
elementType: O N C C C C C C C C C C C C H H H H H H H H H H H H H H H H H H H H H H H H H
charge: -0.281591 -0.412530 -0.175523 -0.390739 -0.391686 0.322998 0.176575 -0.350672 -0.349448 -0.756855 -0.694401 -0.694338 -0.699875 -0.700014 0.232396 0.171228 0.198608 0.199033 0.170301 0.298530 0.217399 0.205202 0.205103 0.216525 0.217178 0.228625 0.217239 0.269973 0.202777 0.203160 0.202839 0.203086 0.269983 0.208286 0.206109 0.219945 0.219982 0.208415 0.206175
chargesum: 0.00000
title: Mulliken charges with hydrogens summed into heavy atoms:
elementType: O N C C C C C C C C C C C C
charge: -0.281591 -0.114000 0.056874 -0.020903 -0.022352 0.322998 0.176575 0.071930 0.072180 -0.093813 -0.018491 -0.018429 -0.065535 -0.065442
polarizability: 1.47560805e+02 4.19679363e-02 1.45478666e+02 -2.45159655e-03 -1.19951973e-01 1.25589367e+02
1716.lowfreq: -6.4528 -0.0002 0.0006 0.0007 8.7334 11.8537 21.0901 39.7597 54.6494
frequency: 19.9103 39.7087 54.5300 70.3159 77.9234 93.3337 101.3625 120.5843 150.8683 193.6658 202.7591 217.2301 230.7001 237.5580 254.3757 259.4497 269.1969 294.1595 308.3041 336.8180 349.8697 403.5181 417.6393 442.9029 496.0020 512.4602 530.0813 572.1134 714.5561 737.4327 748.5596 765.1893 851.5774 853.9026 873.4413 886.9297 910.2223 912.8447 922.5428 942.2002 948.0047 1011.8717 1024.9543 1031.3069 1036.8496 1054.6796 1062.3871 1077.4911 1108.9615 1114.1035 1141.1860 1205.9463 1216.9912 1227.3115 1232.8541 1234.7394 1254.8028 1274.0459 1290.0477 1290.6453 1301.7253 1318.6326 1323.4091 1347.7556 1361.1296 1367.7652 1369.4932 1386.8328 1389.6579 1395.0307 1447.9115 1457.4499 1458.2161 1465.6872 1466.5510 1471.5364 1472.0690 1472.8037 1476.6795 1478.5264 1484.5336 1485.1587 1485.8589 1492.3842 1503.3134 1604.0618 2945.8536 2951.7579 2970.2946 2970.6319 2970.9310 2978.5993 2980.3407 2981.1564 2985.1291 2994.4049 2995.6148 3017.9629 3031.2645 3036.5881 3061.9805 3066.9396 3067.6272 3072.0714 3072.6534 3074.2103 3078.3671 3090.4829 3103.2205 3107.8389 3523.2256
redmass: 3.2101 3.3806 2.8641 1.6349 1.5969 3.1431 4.9391 2.9398 3.1787 2.1071 1.0283 1.8089 1.3085 1.3758 2.0695 1.1493 1.0701 3.6940 2.8626 2.3467 3.3630 2.4660 2.6320 2.8155 3.0117 1.2756 3.1851 2.6650 1.6282 1.3070 1.9873 2.3429 2.0596 1.4380 2.1019 1.9763 1.6325 1.6867 1.6777 1.8143 1.2108 3.4871 1.6394 1.3885 1.5022 2.3317 1.8657 2.2609 1.7712 2.1662 2.7204 1.8963 1.4139 1.7853 2.4278 3.0330 1.2289 1.7882 1.0998 1.2293 1.5883 1.3439 1.3131 1.5456 1.5250 1.2127 1.2153 1.2146 1.2145 1.2217 1.0480 1.1042 1.2628 1.0533 1.0807 1.0607 1.0534 1.0681 1.0428 1.0425 1.0762 1.0869 1.0531 1.4009 1.0617 5.8903 1.0608 1.0601 1.0357 1.0361 1.0359 1.0607 1.0355 1.0606 1.0365 1.0918 1.0975 1.0922 1.1021 1.0997 1.1002 1.1011 1.1010 1.0991 1.0990 1.1001 1.0993 1.0978 1.1000 1.0993 1.0770
irintensity: 1.9672 0.4536 0.0568 0.0080 0.0086 0.5579 11.2567 0.1326 1.4789 0.1960 0.0816 2.4332 0.5408 1.1604 0.3585 0.0689 0.0454 1.2145 4.3146 0.2618 0.8614 0.5746 2.5205 0.9296 35.0313 58.3042 4.9823 0.1188 1.9746 16.7647 0.9767 2.8927 5.9321 1.6897 3.8777 0.0969 3.2025 0.2070 4.0646 2.3290 0.6926 0.5418 0.6293 0.1140 0.5195 1.8317 10.7630 4.3459 11.9849 4.3438 2.0879 1.7577 0.1837 9.4628 85.9412 20.3988 1.9466 23.4987 0.1574 3.3468 17.0485 2.4894 2.3298 0.1654 0.2128 32.7114 39.4451 12.2846 12.4395 36.2368 0.7266 19.4858 119.9697 2.3737 1.5917 3.7601 0.4902 5.9741 11.4051 13.9257 6.4030 24.6721 7.1794 92.3315 24.3288 123.9240 4.3661 39.9861 45.3452 13.2548 56.2428 23.6890 38.4341 31.5430 22.9991 27.9066 2.6973 7.6692 1.6978 56.5494 24.4686 1.1053 189.6609 40.5969 44.5120 38.0646 31.6013 58.9766 1.8361 17.0256 6.5086
temp: 298.150 k
press: 1.00000 atm
elementType: 8 7 6 6 6 6 6 6 6 6 6 6 6 6 1 1 1 1 1 1 1 1 1 1 1 1 1 1 1 1 1 1 1 1 1 1 1 1 1
symmnumber: 1
zpe: 918906.9 jmol-1
zpe.correction: 0.349993 hartree
zpe.thermalcorrener: 0.368620 hartree
zpe.thermalcorrenthalpy: 0.369564 hartree
zpe.thermalcorrgfe: 0.302725 hartree
zpe.sumelectzpe: -601.107106 hartree
zpe.sumelectthermal: -601.088479 hartree
zpe.sumelectthermalent: -601.087535 hartree
zpe.sumelectthermalfe: -601.154374 hartree
dipole: 0.1360 0.0661 -3.6735
dipole: 3.6766
quadrupole: -83.4858 -89.8313 -96.2444
quadrupole: 0.3201 3.0783 0.2319
quadrupole: 6.3680 0.0225 -6.3905 0.3201 3.0783 0.2319
hfenergy: -601.4570991 hartree
pointgroup: C01 [X(C12H25N1O1)]
dipole: 0.0207779 0.0220854 -1.4461602 debye
polarizability: 147.5355434|-0.1634876|145.4905693|-0.5459482|-0.0957764|125.6027254 unknown
InChI: InChI=1S/C12H25NO/c1-6-8-10(9-7-2)11(14)13-12(3,4)5/h10,13H,6-9H2,1-5H3
charge 0 multiplicity 1
39 atoms
O  -0.364001 -0.008365 1.923257
N  -0.91602 0.050059 -0.34427
C  1.474885 -0.068089 0.279758
C  1.803627 -1.368375 -0.508191
C  1.916852 1.199973 -0.504809
C  -2.406852 0.113749 -0.212443
C  -0.010269 -0.005722 0.700575
C  1.467226 -2.669348 0.255116
C  1.689806 2.523646 0.259718
C  -2.97495 0.16253 -1.651252
C  -2.922859 -1.150893 0.523351
C  -2.811739 1.393954 0.56477
C  1.84048 -3.937212 -0.542548
C  2.174906 3.756487 -0.532589
H  2.027739 -0.093174 1.2388
H  1.271056 -1.368421 -1.483694
H  2.886004 -1.359497 -0.753201
H  2.995616 1.099023 -0.744927
H  1.391372 1.245644 -1.483366
H  -0.538882 0.049113 -1.294846
H  0.386425 -2.686724 0.497023
H  1.998643 -2.666844 1.227419
H  2.215273 2.473362 1.234125
H  0.613454 2.633383 0.498057
H  -2.692361 -0.740748 -2.225104
H  -4.076973 0.209909 -1.618222
H  -2.613869 1.056831 -2.194272
H  -2.477159 -1.211096 1.529585
H  -2.657589 -2.064789 -0.03946
H  -4.023005 -1.108788 0.62255
H  -2.457901 2.298839 0.037269
H  -3.912044 1.449808 0.654872
H  -2.372264 1.377625 1.575297
H  2.923268 -3.961832 -0.769784
H  1.295585 -3.976419 -1.505137
H  1.593366 -4.854955 0.02176
H  2.009064 4.690367 0.03497
H  3.256101 3.685861 -0.757827
H  1.63779 3.847633 -1.496033
