program: Gaussian 09
title: 000200805
version: EM64L-G09RevD.01
frameworkgroup: C1[X(C8H11BrN5OP)]
method: RPBEPBE
basis: SDD
operation: Freq
keyword: #p
keyword: freq=noraman
keyword: PBEPBE/SDD
title: #p freq=noraman PBEPBE/SDD
converged: YES YES NO NO
title: Mulliken charges:
elementType: Br P O N N N N N C C C C C C C C H H H H H H H H H H H
charge: 0.034863 1.275887 -0.600199 -0.416718 -0.436227 -0.757438 -0.086513 -0.016258 -0.392441 -0.372309 -0.381467 -0.389483 0.438553 -0.309945 -0.207727 -0.336843 0.251627 0.267996 0.262220 0.250324 0.298224 0.243631 0.253141 0.252011 0.356718 0.265937 0.252438
chargesum: 0.00000
title: Mulliken charges with hydrogens summed into heavy atoms:
elementType: Br P O N N N N N C C C C C C C C
charge: 0.034863 1.275887 -0.600199 -0.416718 -0.436227 -0.400720 -0.086513 -0.016258 0.127182 0.140236 0.160388 0.115669 0.438553 -0.309945 0.058210 -0.084405
polarizability: 1.90387333e+02 -6.15810796e+00 1.78826158e+02 3.27477737e+00 1.40815155e+01 1.20803253e+02
1716.lowfreq: -6.1775 -0.0011 -0.0010 -0.0007 4.6711 10.4697 25.6403 27.6201 43.6364
frequency: 25.5669 27.0041 43.5650 58.3807 84.6131 95.9861 120.1851 149.2149 160.2865 163.3574 201.7838 236.0824 243.9052 281.6831 298.4558 332.7906 351.4218 373.1135 411.9163 446.6951 512.2268 573.9897 586.8485 601.6448 659.1390 682.6599 747.5887 767.0409 793.3790 809.8677 811.8408 844.0972 884.3117 896.7837 903.7199 913.3950 946.9968 957.5351 996.3758 1005.7358 1019.9520 1074.1813 1085.5001 1113.5040 1115.6100 1117.2775 1118.6059 1144.3262 1148.9209 1153.9109 1173.9184 1238.4387 1275.6954 1287.6490 1320.6072 1360.2566 1386.4375 1432.8414 1447.9697 1450.4869 1466.5577 1468.5142 1488.6000 1541.7315 3077.1652 3077.5887 3082.5381 3085.1836 3157.7969 3164.3458 3185.3824 3188.0910 3202.2018 3204.9419 3486.6044
redmass: 6.3519 3.4956 3.9559 4.1614 8.2655 3.9308 5.2219 5.1609 3.4234 5.3661 4.1506 7.7326 4.8937 6.6167 10.7892 7.1895 5.0767 5.0558 4.3652 7.9596 7.2242 3.3248 3.8905 6.1935 1.6771 7.0560 7.1624 6.7780 8.9823 1.1020 1.0745 8.9123 4.5949 5.2062 1.4596 4.7930 1.4646 10.1601 1.0585 1.1559 6.1524 1.2643 1.2590 1.4646 1.7900 1.5644 1.4164 1.2705 1.4015 1.3925 3.3148 3.3461 3.7970 4.8372 1.9954 1.3706 1.7323 1.6646 1.6745 1.0774 1.1648 1.1907 3.9173 7.3289 1.0501 1.0503 1.0580 1.0599 1.0920 1.0941 1.1179 1.1180 1.1184 1.1177 1.0756
irintensity: 0.7901 1.9875 0.7909 2.6672 0.9729 1.4009 0.6577 4.5009 7.8087 6.5676 9.2245 7.2207 4.7384 4.5772 1.3952 2.0176 7.3234 4.6923 0.0174 71.2475 75.2212 15.3057 14.1262 6.6500 120.4061 33.6485 81.5917 38.8068 3.5097 26.4040 31.8116 15.1305 176.4662 101.8540 17.5591 123.4133 0.8524 74.1816 1.2424 10.2751 111.8627 3.3747 5.2162 6.4406 1.6336 8.0895 19.9848 7.3154 1.6292 0.3423 28.7940 62.3965 83.5470 17.3745 26.0341 4.5514 17.6099 84.6520 77.0483 7.1076 2.2605 8.3474 10.9312 612.7251 22.1641 10.1659 42.8207 24.0156 10.8524 7.4532 11.5255 1.0853 4.4607 9.2143 57.0208
temp: 298.150 k
press: 1.00000 atm
elementType: 35 15 8 7 7 7 7 7 6 6 6 6 6 6 6 6 1 1 1 1 1 1 1 1 1 1 1
symmnumber: 1
zpe: 510473.6 jmol-1
zpe.correction: 0.194429 hartree
zpe.thermalcorrener: 0.211052 hartree
zpe.thermalcorrenthalpy: 0.211996 hartree
zpe.thermalcorrgfe: 0.147138 hartree
zpe.sumelectzpe: -1013.805664 hartree
zpe.sumelectthermal: -1013.789042 hartree
zpe.sumelectthermalent: -1013.788098 hartree
zpe.sumelectthermalfe: -1013.852956 hartree
dipole: -0.5078 1.3974 1.3228
dipole: 1.9900
quadrupole: -107.3092 -113.5280 -109.8715
quadrupole: -11.7797 -9.2743 -11.5722
quadrupole: 2.9270 -3.2917 0.3647 -11.7797 -9.2743 -11.5722
hfenergy: -1014.0000935 hartree
pointgroup: C01 [X(C8H11Br1N5O1P1)]
dipole: -0.1178627 0.2236531 -0.7409962 debye
polarizability: 184.9401912|-1.3508805|153.0993289|-11.1395781|-34.0752311|151.9772239 unknown
InChI: InChI=1S/C8H11BrN5OP/c9-7-5-10-6-11-8(7)12-16(15,13-1-2-13)14-3-4-14/h5-6,12H,1-4H2
charge 0 multiplicity 1
27 atoms
Br -2.553721 -1.608912 2.650074
P  1.781715 -0.423123 0.600777
O  2.607762 -1.168927 1.749855
N  1.670413 -1.1992 -1.001776
N  2.38897 1.151258 0.174264
N  0.081115 -0.480212 1.19258
N  -1.012896 0.877227 -0.413807
N  -3.441906 1.018646 -0.541968
C  1.932469 -2.695422 -1.053061
C  2.9618 -1.729516 -1.606556
C  1.867393 2.120874 -0.844597
C  1.886187 2.482957 0.638065
C  -1.085012 -0.001199 0.640148
C  -2.377277 -0.375105 1.137862
C  -3.520406 0.155826 0.524418
C  -2.179029 1.328265 -0.948002
H  1.26765 -3.236231 -1.732044
H  2.180155 -3.201098 -0.111004
H  3.889917 -1.603776 -1.03572
H  3.039662 -1.568254 -2.685403
H  0.888665 1.900175 -1.282766
H  2.641457 2.517091 -1.50966
H  2.655601 3.149016 1.039458
H  0.914538 2.518002 1.146845
H  -0.002362 -1.047388 2.044999
H  -4.523469 -0.105772 0.875338
H  -2.092391 2.018299 -1.792819
