program: Gaussian 09
title: 000200870
version: EM64L-G09RevD.01
frameworkgroup: C1[X(C22H26N2O6)]
method: RPBEPBE
basis: SDD
operation: Freq
keyword: #p
keyword: freq=noraman
keyword: PBEPBE/SDD
title: #p freq=noraman PBEPBE/SDD
converged: YES YES NO NO
title: Mulliken charges:
elementType: O O O O O O N N C C C C C C C C C C C C C C C C C C C C C C H H H H H H H H H H H H H H H H H H H H H H H H H H
charge: -0.277900 -0.277903 -0.295432 -0.295449 -0.267469 -0.267468 -0.105803 -0.105805 -0.365029 -0.380703 -0.380696 -0.365025 0.195746 0.195737 -0.428438 -0.428449 0.358997 0.359013 -0.332291 -0.332295 -0.349905 -0.349906 -0.356746 -0.356744 -0.327809 -0.327810 0.317155 0.317156 -0.536697 -0.536697 0.236832 0.253956 0.265585 0.241171 0.241177 0.265582 0.253973 0.236833 0.259142 0.218863 0.259144 0.218881 0.248538 0.248538 0.248258 0.248256 0.240597 0.240599 0.254252 0.254253 0.218965 0.245877 0.220276 0.245878 0.220276 0.218966
chargesum: 0.00000
title: Mulliken charges with hydrogens summed into heavy atoms:
elementType: O O O O O O N N C C C C C C C C C C C C C C C C C C C C C C
charge: -0.277900 -0.277903 -0.295432 -0.295449 -0.267469 -0.267468 -0.105803 -0.105805 0.125759 0.126053 0.126063 0.125781 0.195746 0.195737 0.049567 0.049576 0.358997 0.359013 -0.083753 -0.083757 -0.101648 -0.101650 -0.116149 -0.116145 -0.073557 -0.073557 0.317155 0.317156 0.148421 0.148422
polarizability: 4.25368436e+02 -1.41268197e+01 2.55808228e+02 -1.76944141e+01 -1.61942832e+01 1.70276396e+02
1716.lowfreq: -7.8976 -3.7456 -0.0014 -0.0010 0.0007 1.9576 7.9925 11.1249 19.9400
frequency: 7.9925 11.1249 19.9351 21.4433 26.7151 37.8423 52.2532 67.0869 75.1659 87.4153 95.4774 105.3732 106.7079 122.3798 138.8544 161.0201 166.0408 175.2207 183.9041 230.2666 230.5512 238.7181 241.6379 280.0273 309.7440 313.6717 318.1956 349.4722 350.3226 362.4332 362.7578 416.6846 417.5156 426.8320 431.3655 446.5684 461.8305 461.9730 489.2651 504.2516 514.3226 515.1292 516.1560 556.2219 587.8854 589.5526 625.3718 627.2994 652.6220 653.5983 706.1635 706.9750 712.3245 712.3276 745.1815 746.6329 790.8598 790.9301 818.0845 818.9968 827.0508 827.1612 840.2804 904.4508 904.4659 927.7080 935.6449 954.0627 954.1798 967.4739 973.0725 982.1858 988.8357 988.9022 994.0046 995.7075 999.4108 1001.9951 1042.5896 1043.8116 1058.4259 1110.5225 1110.5418 1112.5487 1112.5495 1125.8762 1152.9926 1154.2608 1154.2931 1174.7783 1175.2192 1182.3245 1188.0291 1196.3804 1196.9698 1200.7182 1226.1768 1234.5245 1234.6764 1250.8483 1269.0237 1282.1721 1297.3292 1297.6121 1335.6697 1340.3388 1345.8406 1346.3875 1354.5116 1359.7747 1381.7963 1382.1588 1424.2981 1424.4500 1428.9804 1432.6012 1435.6360 1435.7274 1451.2855 1451.7899 1464.7230 1464.7244 1464.8953 1468.2062 1468.6035 1468.9241 1473.7921 1473.9033 1495.1125 1495.9819 1589.0720 1590.2930 1590.3516 1590.7713 1624.4304 1624.5048 2946.1079 2946.1719 2954.5176 2954.5498 2983.3657 2984.6748 2998.7087 3001.1071 3040.5744 3040.5817 3058.7427 3058.7553 3093.8940 3093.9696 3121.5201 3121.6819 3123.8085 3123.8175 3148.7677 3148.7895 3153.7010 3153.7101 3168.6850 3168.6915 3176.0801 3176.0838
redmass: 6.1426 6.1566 6.5789 3.4960 4.4684 4.4881 7.1440 4.7413 4.8497 3.5540 4.0933 5.2827 5.7962 3.7294 3.4113 4.3893 3.6407 4.2072 4.0114 1.2620 1.2239 3.6159 3.9325 3.6013 2.0502 5.8348 3.0581 3.8277 5.6958 5.9639 6.1923 3.0602 2.9939 2.0148 3.8516 3.0566 4.8131 3.9403 4.8756 4.9745 2.9586 2.3743 3.4295 4.1900 3.2075 4.4407 6.7596 5.4436 6.7337 4.2609 3.0677 4.5782 3.5830 3.5855 4.6778 5.3960 1.3248 1.3274 6.6078 6.6192 1.5808 1.5794 1.5766 1.3861 1.3829 3.5823 2.7441 1.3400 1.3416 4.7005 4.8368 2.8581 6.1572 6.5811 2.3045 2.6058 2.5684 2.3759 2.4744 1.8259 2.1227 1.2698 1.2695 1.2603 1.2603 2.1712 3.6955 1.3374 1.3350 1.3050 1.2727 1.4643 1.5926 1.7757 1.8053 1.4193 2.3036 4.9291 4.8475 1.4551 1.5834 1.4612 1.2902 1.2939 1.2812 1.2632 1.3825 1.3800 1.3307 1.4255 5.0969 4.9038 3.8188 3.8104 3.0606 2.5174 1.1729 1.1717 1.1945 1.1059 1.0503 1.0504 1.1302 1.1506 1.1212 1.1252 1.0736 1.0740 2.0781 2.1159 7.5634 7.7274 7.7506 8.0274 6.3852 6.3810 1.0640 1.0640 1.0334 1.0334 1.0693 1.0697 1.0645 1.0650 1.1038 1.1038 1.0974 1.0974 1.0986 1.0986 1.0940 1.0940 1.0989 1.0989 1.0870 1.0870 1.0881 1.0881 1.0956 1.0956 1.0974 1.0974
irintensity: 0.2430 0.0989 0.0000 3.0667 0.0000 0.0000 7.6158 2.1433 0.0000 0.0000 5.5671 0.0000 1.7434 0.0000 12.2645 13.4906 0.0000 13.9418 0.0000 0.0046 2.0393 0.0000 11.5478 0.0000 4.7362 0.0000 18.4472 16.8797 0.0002 0.4866 0.0000 1.1947 0.0000 0.0000 11.5917 0.0000 0.4260 0.0000 0.0000 13.8830 0.0000 38.6998 0.0000 34.0009 13.4146 0.0001 0.0000 1.0019 0.0001 15.0501 6.9137 0.0000 0.3062 0.0012 128.7465 0.0004 0.0000 44.2519 53.8159 0.0000 0.0344 147.3205 0.0000 0.2134 0.0001 0.0000 6.9864 0.0000 0.2617 51.0573 0.0000 167.5390 0.0061 85.0165 0.0000 86.1830 0.0000 63.2885 0.0000 19.2744 7.3790 0.0181 36.8004 0.0991 0.2205 0.0000 21.2402 4.7756 0.0005 46.9020 0.0000 579.2031 0.0000 0.0000 443.2048 0.0000 0.0000 39.9733 0.0003 94.2469 0.0000 41.4188 12.6078 0.0000 0.0000 6.2011 10.9573 0.0001 0.0000 18.5318 0.0000 13.1480 0.0000 7.4746 0.0002 219.7503 46.3261 0.0026 52.2608 0.0009 5.0032 21.6614 50.4767 337.7840 0.0001 0.0000 12.9310 0.0000 455.4954 0.0003 634.4044 0.0022 44.6644 0.0007 2.8722 0.0000 0.0005 70.5818 145.3563 0.6528 34.5130 0.0006 0.0001 120.8792 4.3260 99.6262 29.2437 0.0135 11.6096 0.0045 11.4987 0.1136 54.3987 0.4371 38.3068 0.0465 10.7421 0.5903 0.0547 21.3501 1.1067 3.5914
temp: 298.150 k
press: 1.00000 atm
elementType: 8 8 8 8 8 8 7 7 6 6 6 6 6 6 6 6 6 6 6 6 6 6 6 6 6 6 6 6 6 6 1 1 1 1 1 1 1 1 1 1 1 1 1 1 1 1 1 1 1 1 1 1 1 1 1 1
symmnumber: 1
zpe: 1177514.5 jmol-1
zpe.correction: 0.448492 hartree
zpe.thermalcorrener: 0.477529 hartree
zpe.thermalcorrenthalpy: 0.478473 hartree
zpe.thermalcorrgfe: 0.383209 hartree
zpe.sumelectzpe: -1412.510204 hartree
zpe.sumelectthermal: -1412.481166 hartree
zpe.sumelectthermalent: -1412.480222 hartree
zpe.sumelectthermalfe: -1412.575486 hartree
dipole: 0.0002 0.0001 0.0003
dipole: 0.0004
quadrupole: -112.3002 -196.3897 -177.4757
quadrupole: 18.2975 -28.7565 -17.3926
quadrupole: 49.7550 -34.3345 -15.4205 18.2975 -28.7565 -17.3926
hfenergy: -1412.9586953 hartree
pointgroup: C01 [X(C22H26N2O6)]
dipole: -0.0000918 0.0001051 0.0000525 debye
polarizability: 421.3622157|36.2494427|176.4574909|15.8556833|-19.6970136|253.6333534 unknown
InChI: InChI=1S/C22H26N2O6/c1-27-17-3-7-19(8-4-17)29-15-21(25)23-11-13-24(14-12-23)22(26)16-30-20-9-5-18(28-2)6-10-20/h3-10H,11-16H2,1-2H3
charge 0 multiplicity 1
56 atoms
O  1.422131 -0.559366 -3.264238
O  -1.413075 0.531609 3.14494
O  3.666013 -0.098965 -0.698098
O  -3.656815 0.07077 0.578594
O  9.025528 0.527326 0.936771
O  -9.016117 -0.556439 -1.05662
N  0.772533 0.329972 -1.209737
N  -0.763427 -0.357642 1.090409
C  1.011782 1.038236 0.067195
C  -0.613736 -0.158989 -1.377494
C  0.622837 0.131335 1.258168
C  -1.002686 -1.065895 -0.186525
C  1.717125 0.039839 -2.18137
C  -1.708041 -0.067511 2.062016
C  3.162879 0.498538 -1.945916
C  -3.153726 -0.526422 1.826577
C  5.029786 0.124035 -0.388233
C  -5.020534 -0.15245 0.268652
C  5.918913 0.888696 -1.173945
C  -5.909643 -0.917064 1.054431
C  5.483272 -0.485808 0.809297
C  -5.473985 0.457117 -0.929031
C  7.266134 1.046943 -0.762701
C  -7.25681 -1.07554 0.6431
C  6.81593 -0.328274 1.216671
C  -6.806591 0.299356 -1.33649
C  7.716343 0.439941 0.431826
C  -7.706985 -0.468814 -0.551579
C  9.994846 1.298888 0.158031
C  -9.985415 -1.327963 -0.277818
H  0.390498 1.955826 0.090219
H  2.071318 1.31335 0.159518
H  -0.662542 -0.711989 -2.329552
H  -1.309462 0.701489 -1.418818
H  1.318572 -0.729136 1.2995
H  0.671634 0.684342 2.210222
H  -2.062231 -1.340991 -0.278841
H  -0.38142 -1.983495 -0.209557
H  3.7466 0.138667 -2.8116
H  3.230751 1.607043 -1.892482
H  -3.737543 -0.166445 2.692153
H  -3.221473 -1.634945 1.773348
H  5.59296 1.36433 -2.103666
H  -5.583716 -1.392485 1.98427
H  4.779995 -1.079687 1.401039
H  -4.770724 1.050965 -1.520824
H  7.941787 1.641324 -1.384766
H  -7.932449 -1.669881 1.265218
H  7.184611 -0.791577 2.136543
H  -7.175245 0.762445 -2.256481
H  9.685981 2.358821 0.063985
H  10.935137 1.236844 0.725212
H  10.139132 0.864749 -0.851087
H  -10.925665 -1.26613 -0.84509
H  -10.129835 -0.893652 0.731207
H  -9.67644 -2.387845 -0.183549
