program: Gaussian 09
title: 000200807
version: EM64L-G09RevD.01
frameworkgroup: C1[X(C12H26N2O)]
method: RPBEPBE
basis: SDD
operation: Freq
keyword: #p
keyword: freq=noraman
keyword: PBEPBE/SDD
title: #p freq=noraman PBEPBE/SDD
converged: YES YES NO NO
title: Mulliken charges:
elementType: O N N C C C C C C C C C C C C H H H H H H H H H H H H H H H H H H H H H H H H H H
charge: -0.266958 -0.350095 -0.086359 -0.164819 -0.396144 -0.388424 0.149929 -0.346144 -0.352258 -0.387673 -0.322199 -0.699321 -0.699548 -0.616321 -0.614143 0.231069 0.170147 0.200814 0.198921 0.174689 0.205794 0.212202 0.220099 0.204137 0.290549 0.251383 0.227497 0.208274 0.194195 0.209165 0.206223 0.220057 0.220082 0.207662 0.207206 0.189718 0.222663 0.223438 0.193724 0.231456 0.219315
chargesum: 0.00000
title: Mulliken charges with hydrogens summed into heavy atoms:
elementType: O N N C C C C C C C C C C C C
charge: -0.266958 -0.059546 -0.086359 0.066249 -0.025183 -0.014814 0.149929 0.071851 0.071979 0.091207 0.080269 -0.063876 -0.064599 0.019497 0.030353
polarizability: 1.68804551e+02 1.79105110e+00 1.46020920e+02 -7.60761403e-01 -2.50199526e+00 1.29650602e+02
1716.lowfreq: -9.2536 -2.8215 -0.0006 -0.0003 -0.0001 8.9334 12.3607 25.7331 29.5618
frequency: 10.2666 25.5366 29.5208 42.5276 58.1605 77.9751 83.9807 88.8995 97.1373 101.5032 178.9505 182.7533 216.4897 223.5304 233.0032 235.7702 244.9220 257.4496 283.6311 294.5867 342.8203 348.9265 378.2444 417.9148 462.7764 490.6074 523.8902 547.6735 609.4957 712.7697 741.7538 748.3479 762.1511 820.2431 845.6658 856.0559 873.6814 897.9888 912.2841 987.7216 1018.8233 1024.7294 1033.6847 1038.0304 1055.4481 1060.3096 1061.5398 1077.5242 1087.6978 1090.8619 1114.2432 1129.7696 1139.5291 1142.2270 1181.8582 1214.9059 1215.3806 1249.3251 1253.7758 1258.2882 1266.6974 1287.7736 1289.6687 1295.1768 1301.9319 1315.7165 1319.9613 1333.1342 1347.1138 1359.7999 1377.1138 1389.2824 1390.5367 1420.4735 1441.7069 1446.3472 1458.5582 1461.4135 1466.4925 1467.2893 1471.4623 1474.0551 1475.3496 1477.9540 1478.1260 1479.0254 1484.8274 1485.3367 1486.0480 1491.9474 1607.8379 2852.0238 2860.6855 2873.9847 2944.9421 2951.4319 2970.9550 2971.7263 2977.9262 2980.1528 2995.8149 2996.5080 3010.8806 3017.5150 3017.8142 3019.0386 3031.2295 3032.8380 3037.0661 3067.5460 3068.1865 3073.1688 3073.4615 3075.8245 3088.2762 3093.9810 3550.4216
redmass: 3.1296 3.0780 3.8389 4.4408 3.2961 1.5942 1.8903 2.0041 2.8220 3.4681 2.7759 2.2573 1.7609 1.1116 1.1955 1.1316 1.4833 2.5384 2.9245 3.6676 2.6366 2.9728 2.9420 2.7144 2.6614 3.4848 3.4344 1.1947 2.4856 1.8551 1.2143 1.7219 1.3629 4.0882 2.0631 1.2895 2.1040 1.4085 1.6590 2.6908 2.6957 1.6405 1.6159 2.5262 2.3112 2.4217 1.8862 1.7380 2.3059 1.4527 2.1889 1.9209 1.8469 2.1163 1.8577 1.7045 1.4223 1.7105 1.2228 1.6380 2.3946 1.1599 1.1450 1.2753 1.1699 1.3349 1.3209 1.3715 1.5297 1.5155 1.3177 1.2146 1.2139 1.1432 1.1388 1.1290 1.0770 1.0570 1.0738 1.0682 1.0664 1.0900 1.0656 1.0427 1.0432 1.0793 1.0737 1.0977 1.0758 1.6310 6.3501 1.0589 1.0633 1.0601 1.0615 1.0601 1.0358 1.0358 1.0608 1.0606 1.0920 1.0966 1.0889 1.0680 1.0667 1.0908 1.1021 1.0741 1.0995 1.1010 1.1009 1.0991 1.0991 1.1010 1.1026 1.1007 1.0769
irintensity: 0.9614 0.6881 0.8875 6.7598 1.8188 0.0046 0.1582 0.9736 1.4049 2.6284 0.5936 0.5235 0.3804 0.3854 0.0569 0.0171 0.8581 0.2650 5.3428 2.4125 5.7569 3.6906 7.8538 2.5870 11.6377 9.9361 5.7011 117.1184 4.4819 2.9258 11.0822 0.6795 7.4463 12.2654 2.5941 0.1671 4.0898 0.2351 3.8930 4.4866 17.2879 0.5826 22.4366 6.7232 2.2687 30.6955 9.5433 7.7751 0.2374 7.5821 4.1208 11.3784 6.4542 6.5381 22.9398 22.3736 0.4396 3.5425 3.1094 44.9738 2.6780 1.0993 1.0909 2.5205 2.1145 0.1194 5.5432 7.5099 0.0653 0.1649 7.9654 11.5832 12.0518 3.1954 0.6755 17.4895 0.5638 30.8925 3.7647 2.0479 1.7602 8.2301 8.3519 5.9701 21.8672 19.8502 6.3699 3.8446 42.1842 156.5887 137.3557 81.5848 63.3089 180.6150 7.7852 38.4873 48.2113 41.4749 20.5554 32.8772 27.4971 3.9702 27.9963 10.3684 75.5105 2.1214 2.6532 51.5186 55.1737 2.5087 180.0495 43.4812 48.5143 32.3051 31.9245 24.0673 7.2360
temp: 298.150 k
press: 1.00000 atm
elementType: 8 7 7 6 6 6 6 6 6 6 6 6 6 6 6 1 1 1 1 1 1 1 1 1 1 1 1 1 1 1 1 1 1 1 1 1 1 1 1 1 1
symmnumber: 1
zpe: 964053.2 jmol-1
zpe.correction: 0.367188 hartree
zpe.thermalcorrener: 0.387141 hartree
zpe.thermalcorrenthalpy: 0.388086 hartree
zpe.thermalcorrgfe: 0.315282 hartree
zpe.sumelectzpe: -656.343385 hartree
zpe.sumelectthermal: -656.323432 hartree
zpe.sumelectthermalent: -656.322488 hartree
zpe.sumelectthermalfe: -656.395291 hartree
dipole: -0.1332 1.4544 -3.0290
dipole: 3.3627
quadrupole: -87.5510 -96.3708 -100.6880
quadrupole: 0.3052 1.8888 0.6495
quadrupole: 7.3189 -1.5008 -5.8181 0.3052 1.8888 0.6495
hfenergy: -656.7105737 hartree
pointgroup: C01 [X(C12H26N2O1)]
dipole: 0.0301135 -0.5809583 -1.1882325 debye
polarizability: 168.7618009|2.1689935|146.1137083|-0.2846254|2.325822|129.6005637 unknown
InChI: InChI=1S/C12H26N2O/c1-5-7-11(8-6-2)12(15)13-9-10-14(3)4/h11,13H,5-10H2,1-4H3
charge 0 multiplicity 1
41 atoms
O  0.330343 0.619895 1.758881
N  -0.105387 0.50941 -0.519749
N  -3.904072 0.699687 -0.268372
C  2.050748 -0.397844 0.307704
C  1.886915 -1.802457 -0.339213
C  2.982207 0.513405 -0.542604
C  0.695106 0.277785 0.59068
C  1.03075 -2.784534 0.491946
C  3.254985 1.897878 0.087462
C  -1.435523 1.128674 -0.414621
C  -2.56572 0.07149 -0.346407
C  0.93333 -4.18165 -0.157143
C  4.225066 2.750943 -0.757361
C  -4.983195 -0.217161 -0.691136
C  -4.186844 1.295777 1.055981
H  2.507942 -0.52628 1.307814
H  1.452173 -1.707448 -1.358375
H  2.898805 -2.234389 -0.483047
H  3.946247 -0.017337 -0.68633
H  2.553432 0.650322 -1.558681
H  1.465033 -2.872256 1.507699
H  0.013996 -2.365471 0.628403
H  2.298248 2.440458 0.217619
H  3.668218 1.757563 1.106106
H  0.217583 0.189798 -1.43436
H  -1.425575 1.74007 0.50307
H  -1.613988 1.79283 -1.279396
H  -2.362453 -0.612441 0.516404
H  -2.532456 -0.543931 -1.266729
H  1.9346 -4.638005 -0.273868
H  0.47323 -4.123253 -1.162126
H  0.319518 -4.86768 0.454606
H  4.407806 3.734819 -0.288035
H  5.202835 2.245968 -0.87433
H  3.817855 2.931526 -1.770495
H  -5.097193 -1.10964 -0.024297
H  -5.946466 0.324254 -0.698274
H  -4.787856 -0.578219 -1.716793
H  -4.216829 0.535894 1.877289
H  -3.420321 2.044181 1.316651
H  -5.163695 1.81057 1.025528
