program: Gaussian 09
title: 000200802
version: EM64L-G09RevD.01
frameworkgroup: C1[X(C13H16FNO2)]
method: RPBEPBE
basis: SDD
operation: Freq
keyword: #p
keyword: freq=noraman
keyword: PBEPBE/SDD
title: #p freq=noraman PBEPBE/SDD
converged: YES YES NO NO
title: Mulliken charges:
elementType: F O O N C C C C C C C C C C C C C H H H H H H H H H H H H H H H H
charge: -0.195460 -0.245324 -0.221022 -0.093932 -0.329657 -0.347027 -0.354959 -0.323400 -0.320440 -0.535354 0.117567 0.293110 -0.305725 -0.315685 -0.388000 -0.372532 0.333961 0.192655 0.201559 0.214871 0.193615 0.198104 0.236859 0.190375 0.214573 0.215113 0.192642 0.237854 0.254561 0.253004 0.284799 0.260372 0.262923
chargesum: 0.00000
title: Mulliken charges with hydrogens summed into heavy atoms:
elementType: F O O N C C C C C C C C C C C C C
charge: -0.195460 -0.245324 -0.221022 -0.093932 0.064557 0.061459 0.080005 0.081548 0.087314 -0.042939 0.117567 0.293110 -0.052721 -0.030886 -0.127629 -0.109609 0.333961
polarizability: 2.12475104e+02 1.02385410e+01 1.52954978e+02 4.39010422e-01 -2.02193380e+00 9.21803076e+01
1716.lowfreq: -0.0005 0.0007 0.0007 3.6687 6.2228 13.1802 28.2476 34.4104 47.9649
frequency: 28.0620 32.8761 47.9404 64.3955 90.2099 116.6427 136.4436 184.2232 205.3010 236.2733 281.3059 284.4132 313.6100 363.8691 385.6095 403.1631 411.4752 448.8102 467.1594 479.7592 494.3756 567.7489 570.8337 599.4591 624.8855 721.7793 723.8546 780.5575 793.5149 807.4186 821.0146 824.8260 841.6335 851.3200 900.4887 954.6785 974.7066 988.7504 1002.6168 1009.1167 1027.9251 1033.3693 1054.4465 1071.5809 1093.6851 1103.8481 1105.6510 1130.5115 1142.3279 1156.6420 1188.9042 1192.0781 1202.4442 1214.1295 1247.5572 1267.2559 1289.7549 1292.1622 1295.7441 1307.1232 1331.7405 1344.1500 1362.5912 1370.1037 1380.5038 1392.9969 1410.6561 1433.0861 1442.7597 1448.4707 1450.4550 1458.2826 1473.7210 1491.1969 1571.3778 1601.1111 1612.5992 2859.8926 2868.5028 2885.3415 2952.2908 2956.4489 2970.4200 3020.0743 3027.6235 3030.5934 3052.9602 3079.3270 3083.1767 3155.7949 3157.8179 3178.2838 3181.2507
redmass: 4.0066 3.8570 6.0198 4.5519 4.0385 4.2248 3.4191 6.2725 3.2132 1.8043 5.8944 6.0776 2.3594 7.2363 2.7832 2.6797 2.9463 6.0590 2.9713 3.0816 3.8979 2.3096 4.3646 2.3425 7.1858 3.2511 4.2591 3.0589 1.9265 4.1685 1.6026 2.3405 1.6531 1.5456 2.3970 1.3628 4.1405 1.3449 2.9650 2.4748 2.2101 2.0296 1.9846 2.9903 3.3676 2.0835 1.3223 2.2844 2.6113 1.3975 1.2911 1.2250 2.1457 1.9398 1.4700 1.2730 1.2041 1.2907 1.3422 1.8775 1.2909 1.2969 1.4549 1.2695 5.7611 1.5149 3.9932 1.1025 1.0817 1.0827 1.0962 1.0954 1.0942 2.5866 8.1434 7.3128 7.1580 1.0703 1.0699 1.0702 1.0664 1.0666 1.0597 1.0960 1.0885 1.0907 1.0906 1.0962 1.0977 1.0884 1.0892 1.0964 1.0974
irintensity: 0.8418 0.2367 0.5749 2.1089 3.5827 0.4770 0.6523 1.3410 13.8503 1.8908 3.9264 0.2335 13.5851 1.4914 4.3357 5.7517 0.0377 5.3424 2.1445 7.5908 5.0002 10.2332 18.7194 15.9503 0.3686 1.3077 4.3167 2.9563 30.6739 4.4612 20.1574 24.3878 7.9131 52.2464 19.7098 0.6883 73.0258 1.0669 2.2817 7.5233 10.8105 1.8193 22.4344 15.5060 37.2032 6.6476 13.7933 62.2054 13.5326 81.6495 4.9175 8.5404 13.8530 61.2939 94.4632 5.6505 16.4361 5.4129 9.0804 128.3857 19.7037 29.8539 11.5140 4.0619 13.7756 20.5399 21.4756 11.4111 2.4617 1.1324 18.2322 2.2067 13.5566 24.4424 125.7389 83.5286 55.1248 55.0360 57.3611 126.3914 33.2312 102.5360 27.1387 10.5836 53.6433 31.5584 26.1101 40.1625 37.5017 7.0404 0.1223 3.7481 4.0675
temp: 298.150 k
press: 1.00000 atm
elementType: 9 8 8 7 6 6 6 6 6 6 6 6 6 6 6 6 6 1 1 1 1 1 1 1 1 1 1 1 1 1 1 1 1
symmnumber: 1
zpe: 701537.2 jmol-1
zpe.correction: 0.267201 hartree
zpe.thermalcorrener: 0.282890 hartree
zpe.thermalcorrenthalpy: 0.283834 hartree
zpe.thermalcorrgfe: 0.222198 hartree
zpe.sumelectzpe: -808.713649 hartree
zpe.sumelectthermal: -808.697961 hartree
zpe.sumelectthermalent: -808.697017 hartree
zpe.sumelectthermalfe: -808.758653 hartree
dipole: -0.6541 -1.4881 0.1777
dipole: 1.6352
quadrupole: -120.7858 -99.5700 -100.5970
quadrupole: 1.6529 3.0117 2.1154
quadrupole: -13.8015 7.4143 6.3872 1.6529 3.0117 2.1154
hfenergy: -808.9808508 hartree
pointgroup: C01 [X(C13H16F1N1O2)]
dipole: -0.2590269 -0.5832838 0.0811523 debye
polarizability: 212.5541044|9.9608995|152.7967078|-0.9430944|-3.0160222|92.2595771 unknown
InChI: InChI=1S/C13H16FNO2/c14-12-3-1-11(2-4-12)13(16)5-6-15-7-9-17-10-8-15/h1-4H,5-10H2
charge 0 multiplicity 1
33 atoms
F  -6.015239 -1.213468 0.331818
O  5.64446 -0.913294 -0.091089
O  -0.689292 2.305427 -0.270764
N  2.941523 0.144172 0.156604
C  3.266474 -0.933991 -0.815215
C  4.137092 1.002926 0.375687
C  1.755348 0.946531 -0.230143
C  4.461095 -1.76007 -0.309396
C  5.31428 0.150848 0.87304
C  0.44567 0.157066 -0.059475
C  -0.795049 1.050929 -0.126104
C  -2.152123 0.41461 -0.003429
C  -2.329949 -0.982654 0.189158
C  -3.298388 1.254194 -0.078499
C  -3.621474 -1.53664 0.302907
C  -4.595553 0.721145 0.032047
C  -4.724406 -0.668105 0.220437
H  3.51198 -0.510406 -1.822662
H  2.393294 -1.602862 -0.931807
H  3.891539 1.769161 1.135029
H  4.440872 1.531801 -0.562774
H  1.829345 1.334383 -1.276102
H  1.711753 1.834457 0.425387
H  4.183805 -2.267495 0.640096
H  4.769335 -2.510715 -1.0560
H  6.231316 0.755009 0.970545
H  5.057197 -0.301661 1.855151
H  0.350407 -0.641617 -0.82193
H  0.472592 -0.356938 0.923409
H  -1.464127 -1.648333 0.255448
H  -3.140214 2.327619 -0.22337
H  -3.780325 -2.608262 0.451843
H  -5.487537 1.351434 -0.023348
