program: Gaussian 09
title: 000200832
version: EM64L-G09RevD.01
frameworkgroup: C1[X(C14H23PS2)]
method: RPBEPBE
basis: SDD
operation: Freq
keyword: #p
keyword: freq=noraman
keyword: PBEPBE/SDD
title: #p freq=noraman PBEPBE/SDD
converged: YES YES NO NO
title: Mulliken charges:
elementType: S S P C C C C C C C C C C C C C C H H H H H H H H H H H H H H H H H H H H H H H
charge: -0.041746 -0.040645 0.225684 -0.326232 -0.318361 -0.663891 -0.688473 -0.327224 -0.322292 -0.172695 -0.684955 -0.685503 -0.239547 -0.233497 -0.224188 -0.224422 -0.228347 0.203281 0.212740 0.202086 0.218900 0.257422 0.265365 0.259844 0.270940 0.192654 0.218621 0.190566 0.222653 0.219170 0.205222 0.210672 0.220373 0.207530 0.202740 0.264836 0.259370 0.230200 0.230217 0.230934
chargesum: 0.00000
title: Mulliken charges with hydrogens summed into heavy atoms:
elementType: S S P C C C C C C C C C C C C C C
charge: -0.041746 -0.040645 0.225684 0.089789 0.102625 -0.141104 -0.157689 0.084051 0.090928 -0.172695 -0.049892 -0.054861 0.025289 0.025873 0.006012 0.005795 0.002587
polarizability: 2.92855914e+02 -6.98339325e+00 2.49475335e+02 1.36079527e+01 7.37492071e+00 1.40042748e+02
1716.lowfreq: -7.5104 -5.5594 -0.8983 0.0016 0.0018 0.0031 5.3379 16.3159 24.2746
frequency: -3.9369 16.2353 24.1717 31.8471 35.4047 47.5909 72.9653 82.9779 87.8343 105.8478 122.7402 132.5692 143.2782 161.6115 203.3787 218.4605 228.9667 239.8500 247.0638 250.2486 286.1321 300.0864 389.9438 391.8234 397.3472 419.2509 460.8325 467.7563 495.3351 597.4502 611.8484 614.0279 668.7545 698.6004 741.5350 742.5897 755.9681 791.1118 810.9261 855.5081 868.9006 870.3146 913.3562 921.8744 930.9366 981.8601 984.0706 999.8329 1013.4017 1013.5796 1017.9967 1061.1378 1062.5788 1064.7121 1069.7533 1071.2122 1080.6278 1106.3510 1108.1113 1173.6856 1191.3570 1194.5754 1197.9753 1222.8456 1224.0081 1271.7411 1275.2514 1291.5004 1293.0250 1302.5157 1307.0561 1308.3175 1356.7396 1358.0155 1371.7331 1387.9097 1389.9211 1422.1823 1429.3763 1447.3434 1454.3206 1456.6074 1459.6014 1472.0812 1473.6624 1475.9617 1478.2897 1485.0027 1485.2012 1578.4390 1590.5366 2956.4509 2960.6357 2969.6347 2972.3701 2975.4495 2975.7260 3004.6744 3008.0576 3015.6778 3018.8708 3035.2802 3038.0202 3065.1513 3069.0459 3074.0797 3074.9181 3087.8621 3090.3996 3125.1006 3132.6045 3143.2266 3151.9508 3165.3468
redmass: 4.5785 3.3941 3.9735 4.6814 2.8302 4.1265 1.7101 3.3438 2.2293 3.3458 5.8108 3.8672 5.0009 7.2133 3.2198 1.2638 1.4784 2.3829 1.9580 2.3296 3.3673 3.3189 7.3966 13.2992 2.8447 11.6221 2.9459 3.1250 3.9022 4.4231 6.0634 4.0929 6.7208 2.0304 1.1556 1.1625 1.5958 1.6672 1.6791 1.2443 1.3858 1.3884 1.4013 1.3305 1.3702 1.3877 6.0449 1.3274 2.6843 2.6510 3.7384 1.2313 1.9164 2.0370 2.2830 1.3545 1.6532 2.1013 2.0963 1.0532 1.4655 1.1369 1.4152 1.3438 1.3298 1.2058 1.2039 1.1124 1.1481 1.2910 1.3384 1.2363 1.5975 1.5704 6.6427 1.2143 1.2144 2.1697 1.0902 1.0887 1.0774 1.0804 1.9863 1.0609 1.0524 1.0446 1.0441 1.0782 1.0765 5.8180 5.8612 1.0605 1.0615 1.0363 1.0362 1.0635 1.0616 1.0838 1.0709 1.0826 1.0708 1.0992 1.1006 1.1006 1.1010 1.0993 1.0992 1.1085 1.1059 1.0847 1.0876 1.0923 1.0963 1.1018
irintensity: 0.4290 0.0403 0.1227 0.2181 0.5942 0.3417 0.0072 0.2089 0.2904 0.5218 0.5933 0.2490 0.1705 1.1877 0.3000 0.5854 0.6444 2.5297 0.0562 2.3123 0.5721 0.5731 2.5804 24.7953 0.0393 55.0182 0.6414 6.7296 18.3573 3.8132 0.4597 3.8664 0.0846 41.1840 7.5532 22.3475 54.3793 0.9919 1.0863 0.2678 4.0055 10.2793 11.5405 9.6282 1.1851 0.2478 2.5370 0.3489 1.3641 7.7752 5.3402 3.4116 3.5917 4.0085 11.3670 3.8253 4.3561 2.7554 0.9515 0.0769 6.6516 5.8714 2.9760 2.0467 2.2676 10.7391 17.0437 10.7321 13.4897 0.4315 2.1928 9.4078 4.5313 1.7143 0.0529 13.7997 11.4084 16.6970 13.1546 11.9723 6.4312 8.1650 19.8459 3.4272 2.4301 12.0592 12.9409 27.6495 0.9728 0.3330 3.7480 20.6173 19.5539 38.4879 57.0024 23.5687 44.4942 8.2138 14.4393 14.2741 24.7511 17.7606 23.8861 113.3956 67.5894 32.6978 54.3512 27.2956 11.0577 0.0683 4.1092 3.7563 24.2552 42.4653
temp: 298.150 k
press: 1.00000 atm
elementType: 16 16 15 6 6 6 6 6 6 6 6 6 6 6 6 6 6 1 1 1 1 1 1 1 1 1 1 1 1 1 1 1 1 1 1 1 1 1 1 1
symmnumber: 1
zpe: 879421.5 jmol-1
zpe.correction: 0.334954 hartree
zpe.thermalcorrener: 0.355976 hartree
zpe.thermalcorrenthalpy: 0.356920 hartree
zpe.thermalcorrgfe: 0.281267 hartree
zpe.sumelectzpe: -1683.329360 hartree
zpe.sumelectthermal: -1683.308337 hartree
zpe.sumelectthermalent: -1683.307393 hartree
zpe.sumelectthermalfe: -1683.383046 hartree
dipole: 0.7671 -0.4347 1.7484
dipole: 1.9582
quadrupole: -113.4961 -117.9430 -132.3828
quadrupole: -2.7196 3.0993 0.0203
quadrupole: 7.7779 3.3310 -11.1088 -2.7196 3.0993 0.0203
hfenergy: -1683.6643135 hartree
pointgroup: C01 [X(C14H23P1S2)]
dipole: 0.0777917 0.211609 0.7366781 debye
polarizability: 249.1237634|-1.6790784|285.86008|-5.6619398|36.186472|147.3901524 unknown
InChI: InChI=1S/C6H5P.2C4H9S/c7-6-4-2-1-3-5-6;2*1-2-3-4-5/h1-5H;2*2-4H2,1H3
charge 0 multiplicity 1
40 atoms
S  -1.228153 -0.214836 -0.51528
S  2.419461 -0.410663 -0.937071
P  0.667131 -1.226424 0.355903
C  -2.764443 1.815938 0.728261
C  2.733302 1.79743 0.915917
C  -1.331507 1.255325 0.698902
C  3.370841 0.474469 0.461882
C  -3.24131 2.408624 -0.61795
C  2.644957 2.876183 -0.185594
C  0.416583 -2.905846 -0.474245
C  -4.659634 3.010039 -0.525371
C  2.005143 4.186726 0.321429
C  1.501322 -3.612458 -1.053791
C  -0.857012 -3.530902 -0.388301
C  1.313255 -4.925605 -1.5414
C  -1.037368 -4.843271 -0.87798
C  0.046086 -5.545859 -1.454874
H  -2.798124 2.610011 1.504234
H  -3.464389 1.022141 1.056478
H  3.335689 2.190029 1.763361
H  1.721777 1.593972 1.322195
H  -0.611925 2.019764 0.357602
H  -1.028347 0.88199 1.692154
H  4.372095 0.638476 0.023258
H  3.465717 -0.239683 1.296662
H  -2.523361 3.187641 -0.946116
H  -3.219556 1.619677 -1.395184
H  3.663244 3.085035 -0.572672
H  2.062856 2.473996 -1.037133
H  -4.981965 3.431388 -1.494907
H  -4.700596 3.821298 0.226371
H  -5.397889 2.240817 -0.229625
H  1.948237 4.943409 -0.48216
H  2.587839 4.621863 1.155528
H  0.97621 4.009523 0.690187
H  2.481523 -3.130276 -1.134476
H  -1.704514 -2.989101 0.045173
H  2.157382 -5.458954 -1.992771
H  -2.025262 -5.312846 -0.812396
H  -0.097597 -6.562838 -1.836696
