program: Gaussian 09
title: 000200836
version: EM64L-G09RevD.01
frameworkgroup: C1[X(C12H19N2O5PS)]
method: RPBEPBE
basis: SDD
operation: Freq
keyword: #p
keyword: freq=noraman
keyword: PBEPBE/SDD
title: #p freq=noraman PBEPBE/SDD
converged: YES YES NO NO
title: Mulliken charges:
elementType: S P O O O O O N N C C C C C C C C C C C C H H H H H H H H H H H H H H H H H H H
charge: -0.213563 0.861281 -0.497896 -0.471918 -0.478120 -0.229538 -0.235039 -0.133767 0.003570 0.405922 0.382961 0.209792 -0.437922 -0.393261 -0.328138 -0.670626 -0.653087 -0.214728 -0.211872 -0.651383 -0.651285 0.285715 0.261689 0.283207 0.250881 0.246950 0.237409 0.223208 0.281727 0.248665 0.231150 0.231819 0.226211 0.236662 0.214523 0.230226 0.238553 0.215192 0.223139 0.241689
chargesum: 0.00000
title: Mulliken charges with hydrogens summed into heavy atoms:
elementType: S P O O O O O N N C C C C C C C C C C C C
charge: -0.213563 0.861281 -0.497896 -0.471918 -0.478120 -0.229538 -0.235039 -0.133767 0.003570 0.405922 0.382961 0.209792 -0.152206 -0.131572 -0.044930 0.064615 0.100514 0.248242 0.251001 0.031918 0.028735
polarizability: 2.91344568e+02 2.04702009e+00 2.32002757e+02 3.25338527e-01 9.03267451e+00 1.54198984e+02
1716.lowfreq: -6.8837 -4.1978 -0.0018 0.0007 0.0020 7.4997 9.4021 20.8770 27.8620
frequency: 8.3453 20.7934 27.5498 35.0071 49.8995 56.8452 65.8338 70.4223 82.7823 94.4616 110.5330 122.7825 132.5991 184.6394 186.9600 205.9213 212.7746 220.5957 233.5229 241.4856 249.9453 257.1789 276.8163 283.1116 300.8672 313.7686 339.9335 353.2712 383.6146 405.5871 434.9843 446.3774 458.7875 497.6439 525.9945 561.7692 615.7068 624.0230 649.3880 668.3070 698.8545 705.4573 717.3439 738.6378 781.1963 809.7446 811.2130 812.1427 843.3153 870.5562 877.6688 888.6680 965.5545 991.4791 1013.7232 1021.5284 1059.7020 1063.2214 1092.4861 1104.6237 1105.9578 1119.3223 1128.9341 1133.0117 1134.6489 1153.0144 1191.1044 1204.8986 1227.9695 1255.3211 1256.9300 1280.0519 1325.6548 1350.0599 1355.3042 1356.3407 1391.4897 1395.8045 1396.8204 1429.9650 1433.9536 1454.1437 1457.5150 1458.2988 1465.5352 1475.3860 1477.2578 1478.1356 1486.8296 1487.6483 1487.7733 1490.0695 1516.9436 1564.9988 1614.7200 2948.9183 2976.2661 2991.4974 2992.4208 2996.6257 2998.0018 3052.6486 3060.4890 3061.6806 3064.6262 3086.0806 3092.8709 3094.3748 3101.5395 3110.4468 3112.3189 3173.7011 3183.3506 3194.2450
redmass: 4.9205 4.8047 3.9958 3.8560 2.4347 2.0583 5.0145 3.1822 5.0811 5.2072 3.9768 5.2536 3.3437 1.8344 4.9593 3.3277 2.4072 1.9930 1.5615 1.3189 2.2980 2.0294 4.0762 3.5743 6.0506 4.4031 5.7963 5.7078 3.8595 5.0599 4.6076 5.8861 4.3378 6.1450 4.2694 7.0996 5.9205 5.9216 4.3434 7.7960 5.8973 6.9963 5.2204 6.5924 9.7474 1.4855 1.0945 1.1048 1.6556 4.7305 4.6038 4.8434 1.3280 2.9305 2.4181 2.6409 3.1765 1.6888 1.2310 2.2325 2.2140 1.3934 1.7035 1.4263 1.4273 1.5034 3.3383 4.9636 2.9271 1.1428 1.1412 1.7905 4.5993 3.0913 1.2608 1.2801 5.8190 1.2425 1.2418 1.7024 1.2079 1.7032 1.0445 1.0399 1.0870 1.1489 1.0558 1.0543 1.0945 1.0976 1.0855 1.1855 2.2680 7.0347 6.6375 1.0442 1.0338 1.0538 1.0537 1.0401 1.0394 1.0896 1.1078 1.1066 1.1014 1.1011 1.0985 1.0982 1.1006 1.1022 1.1024 1.0882 1.0905 1.0977
irintensity: 1.2720 0.6684 0.6473 0.3695 0.1168 2.6158 0.6500 3.6038 5.1670 2.6375 2.8153 0.7039 1.4503 0.8598 0.4660 5.5467 1.2427 6.1405 1.3874 0.3638 3.1093 11.6201 12.8167 7.4595 5.7227 2.4153 5.3964 13.2006 0.5497 4.6694 9.7859 11.4646 13.1360 3.3426 7.7354 25.2952 41.0980 4.2631 35.0414 65.9981 71.6108 143.7540 24.6614 82.3684 35.3066 11.5584 3.5827 6.8365 50.6029 224.7832 294.2356 27.6444 3.6055 146.8776 144.6708 83.7505 14.8917 11.9678 4.2287 16.4132 11.5019 1.9464 83.0471 3.6471 4.6297 45.9055 328.0870 357.1532 2.4206 0.1648 0.3497 17.1372 107.7194 12.5430 8.4664 6.5524 10.6248 24.8864 27.8581 15.0706 3.4709 51.0119 15.2685 13.3680 28.9705 16.9649 5.7080 8.5803 7.9487 8.2233 9.2922 9.5967 87.7831 181.8156 322.3524 62.5442 46.9421 23.9109 21.1900 21.3746 23.6081 23.3699 10.2411 8.0652 16.6077 11.6288 32.4670 24.9018 19.8707 30.3650 31.2428 1.3341 0.2808 1.6820
temp: 298.150 k
press: 1.00000 atm
elementType: 16 15 8 8 8 8 8 7 7 6 6 6 6 6 6 6 6 6 6 6 6 1 1 1 1 1 1 1 1 1 1 1 1 1 1 1 1 1 1 1
symmnumber: 1
zpe: 805755.9 jmol-1
zpe.correction: 0.306896 hartree
zpe.thermalcorrener: 0.331555 hartree
zpe.thermalcorrenthalpy: 0.332500 hartree
zpe.thermalcorrgfe: 0.248386 hartree
zpe.sumelectzpe: -1691.860734 hartree
zpe.sumelectthermal: -1691.836074 hartree
zpe.sumelectthermalent: -1691.835130 hartree
zpe.sumelectthermalfe: -1691.919244 hartree
dipole: -6.5172 3.6480 1.0145
dipole: 7.5373
quadrupole: -153.9881 -118.9529 -147.6916
quadrupole: 16.2148 10.6410 0.5492
quadrupole: -13.7772 21.2580 -7.4807 16.2148 10.6410 0.5492
hfenergy: -1692.1676298 hartree
pointgroup: C01 [X(C12H19N2O5P1S1)]
dipole: 2.5669259 1.4556947 -0.2922949 debye
polarizability: 291.2927136|-1.8140031|232.5900844|2.9026712|-5.9386303|153.6635111 unknown
InChI: InChI=1S/C12H19N2O5PS/c1-5-17-20(21,18-6-2)19-10-7-8-11(14(15)16)12(9-10)13(3)4/h7-9H,5-6H2,1-4H3
charge 0 multiplicity 1
40 atoms
S  2.466426 0.352243 -2.232843
P  2.564899 0.007987 -0.205121
O  1.379058 -1.053275 0.515212
O  3.984695 -0.727882 0.42017
O  2.41831 1.360873 0.849264
O  -4.852665 -2.07683 -0.115545
O  -4.876177 0.05591 0.69869
N  -2.640202 1.564711 -0.455402
N  -4.252002 -0.962844 0.183028
C  -2.070574 0.351171 -0.096552
C  -0.015811 -0.953491 0.295494
C  -2.798509 -0.892208 0.017574
C  -0.653311 0.278601 0.114028
C  -0.725248 -2.182101 0.285137
C  -2.114882 -2.130804 0.155781
C  -1.898882 2.82077 -0.248553
C  -3.870634 1.665963 -1.257091
C  4.562161 -1.913006 -0.291766
C  3.383445 2.495274 0.67337
C  5.944318 -2.13725 0.311704
C  2.871548 3.627505 1.556753
H  -0.049682 1.188205 0.090915
H  -0.18756 -3.123728 0.414462
H  -2.720222 -3.039797 0.199815
H  -1.399703 2.823916 0.735576
H  -2.614236 3.658942 -0.263285
H  -1.137451 2.996949 -1.037318
H  -3.747663 2.482842 -1.991242
H  -4.761307 1.853997 -0.630335
H  -4.043152 0.730134 -1.815411
H  4.608738 -1.692577 -1.375667
H  3.890801 -2.77404 -0.11962
H  3.410793 2.77916 -0.396717
H  4.382756 2.1435 0.987269
H  6.413356 -3.022558 -0.155878
H  6.595305 -1.263803 0.138482
H  5.872121 -2.313843 1.397951
H  3.561259 4.489262 1.493313
H  1.869549 3.95811 1.233489
H  2.812537 3.304011 2.60937
