program: Gaussian 09
title: 000200811
version: EM64L-G09RevD.01
frameworkgroup: C1[X(C13H16N2O2S)]
method: RPBEPBE
basis: SDD
operation: Freq
keyword: #p
keyword: freq=noraman
keyword: PBEPBE/SDD
title: #p freq=noraman PBEPBE/SDD
converged: YES YES NO NO
title: Mulliken charges:
elementType: S O O N N C C C C C C C C C C C C C H H H H H H H H H H H H H H H H
charge: 0.308880 -0.344269 -0.252340 -0.371354 0.011649 -0.223917 0.496115 0.160933 -0.699209 -0.704675 -0.371077 0.578589 -0.451629 -0.554292 -0.815696 0.270705 -0.346228 -0.602733 0.228410 0.206641 0.208744 0.270907 0.210282 0.226533 0.218706 0.265069 0.259368 0.267665 0.244180 0.230827 0.334722 0.272857 0.232015 0.233624
chargesum: 0.00000
title: Mulliken charges with hydrogens summed into heavy atoms:
elementType: S O O N N C C C C C C C C C C C C C
charge: 0.308880 -0.344269 -0.252340 -0.036632 0.011649 0.004493 0.496115 0.160933 -0.012917 -0.049155 -0.106008 0.578589 -0.451629 -0.294924 -0.073023 0.270705 -0.346228 0.135763
polarizability: 2.41300114e+02 8.10018394e+00 1.67082973e+02 -1.45526622e+01 9.90874566e-01 1.33259773e+02
1716.lowfreq: -6.7831 -4.6042 -0.0014 -0.0013 0.0016 0.8197 32.1246 33.7842 41.0555
frequency: 32.1026 33.7759 41.0462 49.6054 69.6550 85.9693 93.7448 103.9587 131.8803 141.9908 148.3346 154.5725 214.2570 220.0095 227.0088 240.9451 251.9206 261.4342 289.8304 306.8157 320.4536 374.0691 390.0417 402.6874 427.9327 461.0564 493.4828 497.2518 556.6983 586.1536 610.2418 629.9664 644.8865 671.7700 684.1964 712.3135 741.8093 758.6339 855.5421 889.0240 890.5190 904.9370 925.3637 959.0535 966.2554 1005.1464 1047.0062 1058.0219 1066.5645 1104.2922 1115.9001 1126.5443 1146.2291 1151.7062 1192.6821 1194.1383 1247.8961 1260.9381 1303.2606 1325.9540 1374.2860 1377.9244 1379.9705 1399.0019 1403.8584 1432.3076 1458.5950 1461.9634 1466.8957 1469.4347 1472.3876 1476.9907 1480.7555 1483.3754 1493.6647 1513.9564 1560.4153 1615.1159 1706.7178 2102.1295 2976.4858 2979.4630 2981.8014 2983.3177 3014.4568 3060.4734 3062.6183 3067.8960 3076.4524 3079.8411 3095.3571 3097.6652 3115.2923 3149.1370 3154.3625 3573.9769
redmass: 6.5511 6.3414 4.5339 4.2726 3.0211 5.6534 3.2526 1.2260 1.1068 3.5506 5.0046 3.3575 2.1432 1.5089 3.0314 2.5772 1.4039 3.2918 5.0077 4.4163 4.4295 12.4358 4.6831 3.2671 4.1030 6.4549 4.0432 4.0718 3.3932 1.1239 9.1981 8.5738 6.8625 5.1957 12.0205 4.6942 3.7708 3.8446 3.6279 2.0126 1.9589 1.4599 1.1942 1.4284 3.8311 1.5232 1.5359 1.9257 5.0270 2.7380 2.5934 1.2832 1.7315 1.7796 2.1387 2.0414 1.4009 3.7371 1.4094 1.9695 2.8199 3.8694 1.1987 1.2484 1.2267 1.1582 1.3307 1.0801 1.0520 1.3919 1.1983 1.3075 1.1011 1.0478 1.1818 1.3873 6.1887 7.9423 9.5904 12.7488 1.0351 1.0358 1.0378 1.0353 1.0837 1.0967 1.1028 1.0998 1.0986 1.1004 1.0994 1.1001 1.0986 1.0910 1.0923 1.0772
irintensity: 0.9368 0.5817 1.6124 4.8903 1.6059 3.6672 5.2096 1.0114 0.1864 1.4505 0.9888 1.9384 0.8395 0.7045 1.0588 1.4407 0.6302 0.5029 0.1887 7.5363 8.6050 1.2688 6.2840 0.8490 0.4985 6.4823 13.4702 4.8835 3.7828 123.0741 0.1802 6.5009 0.8342 0.9824 24.4366 8.4028 7.9293 1.7145 40.4001 3.5218 22.9305 27.3997 0.9656 0.2057 7.3537 5.6666 10.2671 103.5967 131.3603 296.6490 5.6436 0.0715 91.8793 39.9982 67.6940 117.5079 13.3616 10.1473 6.5751 42.4599 19.3604 14.4790 19.0860 21.3520 13.5649 27.4728 154.1975 39.2171 6.8730 8.3216 13.4552 33.1574 5.3549 11.5650 52.2680 135.7367 1.2486 1.5563 276.3255 24.0949 24.7404 40.6871 15.9050 76.8630 7.5062 9.1716 31.2370 2.1698 96.4543 30.4833 16.7299 14.4280 4.0086 4.3051 3.1485 46.5565
temp: 298.150 k
press: 1.00000 atm
elementType: 16 8 8 7 7 6 6 6 6 6 6 6 6 6 6 6 6 6 1 1 1 1 1 1 1 1 1 1 1 1 1 1 1 1
symmnumber: 1
zpe: 696213.6 jmol-1
zpe.correction: 0.265174 hartree
zpe.thermalcorrener: 0.285438 hartree
zpe.thermalcorrenthalpy: 0.286382 hartree
zpe.thermalcorrgfe: 0.214824 hartree
zpe.sumelectzpe: -1161.644848 hartree
zpe.sumelectthermal: -1161.624584 hartree
zpe.sumelectthermalent: -1161.623639 hartree
zpe.sumelectthermalfe: -1161.695198 hartree
dipole: 5.9021 0.0952 -4.3334
dipole: 7.3227
quadrupole: -106.8712 -104.9519 -124.9885
quadrupole: -8.4245 7.8770 6.1925
quadrupole: 5.3993 7.3186 -12.7179 -8.4245 7.8770 6.1925
hfenergy: -1161.9100214 hartree
pointgroup: C01 [X(C13H16N2O2S1)]
dipole: -2.4079853 -0.1367254 -1.5757076 debye
polarizability: 241.9953381|10.4425163|167.5873145|8.5422347|-1.7606361|132.0602075 unknown
InChI: InChI=1S/C13H16N2O2S/c1-8(2)10-6-12(18-7-14)9(3)5-11(10)17-13(16)15-4/h5-6,8,15H,1-4H3
charge 0 multiplicity 1
34 atoms
S  3.936538 -0.492172 -0.512272
O  -2.016259 0.633593 -0.808502
O  -2.419185 0.508139 1.535673
N  -4.110963 1.005606 -0.026866
N  4.919611 1.045389 1.804357
C  -1.126686 -2.139495 -0.095004
C  -0.179024 -0.964612 -0.341718
C  -0.625881 0.343973 -0.648225
C  -1.049073 -2.613597 1.38109
C  -0.850398 -3.307161 -1.07917
C  1.226061 -1.142289 -0.272316
C  1.663819 1.230918 -0.844224
C  2.11215 -0.077422 -0.519569
C  0.261839 1.410963 -0.89307
C  2.607615 2.385329 -1.10846
C  -2.834278 0.699801 0.371008
C  4.485089 0.427658 0.872894
C  -5.209164 1.164369 0.930873
H  -2.15831 -1.788282 -0.28231
H  -0.036152 -2.983444 1.627446
H  -1.762318 -3.440276 1.555868
H  -1.294699 -1.784426 2.065697
H  0.157462 -3.735937 -0.92609
H  -0.922922 -2.975088 -2.130578
H  -1.584174 -4.118688 -0.920591
H  1.631141 -2.127364 -0.019661
H  -0.155731 2.394971 -1.12894
H  3.133125 2.693419 -0.184806
H  3.386954 2.108317 -1.841379
H  2.060768 3.261461 -1.493923
H  -4.27113 1.137712 -1.025888
H  -4.811074 0.978551 1.940827
H  -6.020922 0.44112 0.731394
H  -5.624031 2.188465 0.898036
