program: Gaussian 09
title: 000200791
version: EM64L-G09RevD.01
frameworkgroup: C1[X(C13H14O3)]
method: RPBEPBE
basis: SDD
operation: Freq
keyword: #pfreq=noraman
keyword: PBEPBE/SDD
title: #p freq=noraman PBEPBE/SDD
converged: YES YES NO NO
title: Mulliken charges:
elementType: O O O C C C C C C C C C C C C C H H H H H H H H H H H H H H
charge: -0.265099 -0.253485 -0.235041 -0.173996 0.552020 0.196995 0.167983 0.181223 -0.494018 -0.693186 -0.700625 -0.400773 -0.297627 -0.339782 -0.319535 -0.203234 0.207420 0.254018 0.220216 0.225360 0.229852 0.236879 0.221214 0.203782 0.244949 0.272990 0.256534 0.219436 0.242657 0.242873
chargesum: 0.00000
title: Mulliken charges with hydrogens summed into heavy atoms:
elementType: O O O C C C C C C C C C C C C C
charge: -0.265099 -0.253485 -0.235041 0.033425 0.552020 0.196995 0.167983 0.181223 -0.240001 -0.017757 -0.038750 -0.155824 -0.024637 -0.083248 -0.100099 0.282296
polarizability: 3.02738356e+02 -2.41042427e+00 1.46220271e+02 3.15557388e+00 4.45596441e+00 8.23616184e+01
1716.lowfreq: -6.3424 -0.0004 0.0005 0.0006 4.3605 9.6028 16.5518 32.1736 36.3261
frequency: 14.5872 31.9540 36.2578 62.1307 67.0884 119.3963 176.3559 180.5185 202.8666 211.0591 224.9918 230.7383 277.6767 299.8761 356.1630 361.0899 415.6213 425.6844 497.8883 511.7257 593.7210 597.2667 636.6679 680.4269 698.1786 729.4555 749.2970 782.7888 816.9795 836.8708 846.4560 871.7484 883.0471 905.3628 922.9153 937.1021 940.5111 960.9205 978.3966 1011.1564 1056.2820 1065.7736 1073.7232 1084.3058 1120.0160 1123.9351 1132.6000 1182.1811 1194.0693 1239.7881 1265.8429 1273.3791 1307.2718 1311.6767 1344.6898 1365.3903 1375.9822 1391.6033 1395.3922 1457.1204 1461.9455 1466.7194 1476.3335 1479.3526 1487.1400 1487.8480 1552.3878 1600.9963 1623.0528 1641.6353 2971.0033 2978.1133 2988.7422 3019.1471 3075.8190 3081.7816 3083.7039 3093.8882 3096.1416 3099.1342 3113.7789 3147.0147 3178.3349 3185.5362
redmass: 2.3354 3.2013 4.0023 4.5579 8.2658 3.2156 3.4592 1.0657 5.0392 4.1546 1.5265 2.8506 3.2608 3.4189 3.5591 3.7116 3.6793 2.8637 4.3974 6.6087 5.3312 4.1936 3.6616 9.6778 4.0056 3.7735 5.8473 6.1916 1.3882 6.0936 5.2242 1.4745 1.8321 2.8849 1.1754 3.3775 1.3466 1.3948 4.6248 1.2010 3.4996 1.4546 3.1399 1.6087 1.0368 2.2683 1.4915 1.7956 1.6397 1.7644 1.7921 1.3913 1.9861 1.3784 2.0065 1.2910 1.2278 2.6568 1.3817 4.2187 1.0523 1.0503 1.0505 2.2835 1.0691 1.3481 7.9746 7.7204 8.1123 5.7357 1.0813 1.0345 1.0369 1.0534 1.1002 1.1009 1.0999 1.0900 1.0993 1.1191 1.0897 1.0901 1.0926 1.0959
irintensity: 14.7764 0.6100 0.6439 0.5623 3.3167 0.2315 0.4513 0.1175 0.1513 0.2862 0.9069 0.3263 6.7146 10.1484 2.6420 3.4753 2.5637 5.0455 1.1032 28.0223 0.8575 5.7159 0.8650 0.2364 0.9962 3.1193 4.0057 5.0361 48.5492 34.3801 4.9171 24.2776 1.2790 23.9409 5.2980 5.1693 3.5672 8.2995 154.5335 41.8824 133.9733 4.1482 128.1496 18.4010 0.0033 14.6875 52.4745 14.2226 16.3899 294.3134 101.2425 3.0727 12.7982 11.1065 15.5247 0.1971 17.2473 40.7657 101.2875 171.2003 8.4546 3.7224 9.5683 119.4060 36.1238 56.1847 345.5785 20.9737 13.2601 177.7988 34.0984 27.8223 37.1007 132.3439 43.9594 15.2491 53.1891 0.5111 31.3491 28.7277 17.2974 5.5122 2.8894 4.9126
temp: 298.150 k
press: 1.00000 atm
elementType: 8 8 8 6 6 6 6 6 6 6 6 6 6 6 6 6 1 1 1 1 1 1 1 1 1 1 1 1 1 1
symmnumber: 1
zpe: 623454.8 jmol-1
zpe.correction: 0.237461 hartree
zpe.thermalcorrener: 0.253158 hartree
zpe.thermalcorrenthalpy: 0.254103 hartree
zpe.thermalcorrgfe: 0.191594 hartree
zpe.sumelectzpe: -728.243619 hartree
zpe.sumelectthermal: -728.227922 hartree
zpe.sumelectthermalent: -728.226977 hartree
zpe.sumelectthermalfe: -728.289486 hartree
dipole: 3.4812 -2.6612 -0.0251
dipole: 4.3819
quadrupole: -88.6167 -92.3188 -96.1224
quadrupole: 6.9180 -0.4474 0.9766
quadrupole: 3.7360 0.0338 -3.7698 6.9180 -0.4474 0.9766
hfenergy: -728.4810801 hartree
pointgroup: C01 [X(C13H14O3)]
dipole: 1.3603869 1.0589342 0.0112394 debye
polarizability: 302.4960887|4.0283551|146.021267|-7.0920074|5.920386|82.8028903 unknown
InChI: InChI=1S/C13H14O3/c1-9(2)11(14)5-3-10-4-6-12-13(7-10)16-8-15-12/h3-7,9H,8H2,1-2H3
charge 0 multiplicity 1
30 atoms
O  3.325807 1.890311 0.252557
O  4.715584 -0.03666 -0.103789
O  -3.687173 -1.542888 0.086169
C  -4.335647 0.807834 0.376051
C  0.557124 -0.659427 -0.00904
C  2.530602 0.726317 0.111831
C  3.354461 -0.406356 -0.098049
C  -3.315179 -0.334888 0.221694
C  1.145264 0.639851 0.161599
C  -4.480072 1.528567 -0.998569
C  -5.696238 0.29834 0.888641
C  1.402689 -1.789198 -0.218632
C  -0.89004 -0.875614 0.023965
C  2.815283 -1.684057 -0.267573
C  -1.880651 0.056726 0.201435
C  4.735035 1.436525 0.125677
H  -3.91632 1.541475 1.096288
H  0.5335 1.529809 0.326667
H  -5.157774 2.396023 -0.901643
H  -3.508664 1.891048 -1.381686
H  -4.907629 0.837391 -1.747474
H  -6.088743 -0.484026 0.216534
H  -5.60426 -0.148532 1.894543
H  -6.426805 1.126382 0.938154
H  0.939629 -2.773715 -0.346482
H  -1.23491 -1.912503 -0.107538
H  3.453501 -2.555787 -0.42887
H  -1.653459 1.121549 0.342312
H  5.268432 1.642781 1.069135
H  5.195952 1.926725 -0.748407
