program: Gaussian 09
title: 000200871
version: EM64L-G09RevD.01
frameworkgroup: C1[X(C22H26N2O6)]
method: RPBEPBE
basis: SDD
operation: Freq
keyword: #p
keyword: freq=noraman
keyword: PBEPBE/SDD
title: #p freq=noraman PBEPBE/SDD
converged: YES YES NO NO
title: Mulliken charges:
elementType: O O O O O O N N C C C C C C C C C C C C C C C C C C C C C C H H H H H H H H H H H H H H H H H H H H H H H H H H
charge: -0.285534 -0.287970 -0.312037 -0.264243 -0.301595 -0.256658 -0.102628 -0.101426 -0.386598 -0.385698 -0.387263 -0.381359 0.205555 0.211557 -0.407898 -0.483354 0.237462 0.278890 0.240935 0.181515 -0.334116 -0.337929 -0.333594 -0.333703 -0.224495 -0.260123 -0.240642 -0.250289 -0.534048 -0.539110 0.226529 0.288393 0.264524 0.247922 0.247362 0.260504 0.277788 0.233884 0.246953 0.248887 0.249010 0.253488 0.256256 0.286584 0.241524 0.243289 0.232051 0.228273 0.228000 0.224460 0.230172 0.225963 0.245380 0.222330 0.219867 0.247004
chargesum: 0.00000
title: Mulliken charges with hydrogens summed into heavy atoms:
elementType: O O O O O O N N C C C C C C C C C C C C C C C C C C C C C C
charge: -0.285534 -0.287970 -0.312037 -0.264243 -0.301595 -0.256658 -0.102628 -0.101426 0.128324 0.126748 0.120602 0.130314 0.205555 0.211557 0.087942 0.019144 0.237462 0.278890 0.240935 0.181515 -0.077860 -0.051345 -0.092070 -0.090414 0.007556 -0.031850 -0.012642 -0.025829 0.167468 0.150091
polarizability: 3.06489972e+02 2.91539097e+00 2.74907310e+02 -2.88447697e+01 1.69032091e+01 2.32409900e+02
1716.lowfreq: -3.1911 -1.7454 0.0003 0.0005 0.0007 3.4173 12.6052 15.1515 20.4473
frequency: 12.2248 14.9522 20.4105 22.4507 27.4460 47.1437 59.5418 73.2869 85.7634 92.4605 96.1497 100.3154 102.5574 142.9931 148.7472 170.4578 180.5969 186.9578 217.1376 227.2523 250.3243 253.2605 267.9446 289.9559 306.4286 310.6245 311.1708 320.5978 326.5999 330.8834 372.5140 419.2116 430.0095 448.3629 454.0243 458.8472 463.8874 481.6591 502.3460 511.0954 539.6540 551.6146 554.7678 557.8047 569.7472 573.2517 587.9702 593.1399 663.8490 676.2291 704.4670 706.5837 721.7944 725.3952 725.4917 742.1562 747.5825 755.7228 788.7083 816.6899 836.5661 840.7079 846.8120 911.7418 915.1207 922.9606 932.9173 940.0739 961.3202 968.9648 970.8361 980.7523 983.7477 983.9486 989.7425 995.9320 1036.5538 1040.6105 1043.5130 1049.3349 1056.4745 1098.8321 1112.7014 1113.1481 1115.0269 1123.8903 1147.3702 1148.7790 1150.9247 1166.1308 1175.9472 1182.0162 1184.2792 1185.5966 1198.7406 1223.1441 1226.6567 1233.5527 1244.1332 1247.7235 1264.6257 1266.2864 1283.7327 1285.8004 1334.7874 1340.6708 1341.9244 1345.0297 1355.7313 1365.1300 1378.8921 1393.6525 1424.4086 1427.6778 1428.8142 1434.8159 1442.5317 1443.3906 1456.0634 1462.4869 1463.6309 1466.7410 1467.5039 1468.2699 1470.5556 1472.0259 1472.9261 1474.9703 1484.1867 1494.9601 1581.1550 1585.8782 1588.7017 1593.1360 1601.7246 1601.9606 2958.8400 2967.0666 2976.6782 2985.0411 2999.2574 2999.3774 3003.1722 3023.1885 3046.8354 3058.5357 3080.1188 3091.0116 3092.6817 3094.7268 3117.5039 3121.6258 3126.3013 3128.1048 3134.9650 3136.9636 3148.8571 3151.4291 3160.6634 3163.5320 3172.5856 3175.4765
redmass: 5.3920 5.1459 5.1947 5.5660 4.8467 6.4244 4.8681 5.1301 5.3220 6.4060 3.3271 4.5331 3.8440 3.6012 4.0989 3.9449 4.6559 3.6748 2.6906 2.2786 1.8164 1.7213 2.9279 3.1334 2.6473 3.9820 4.3964 3.6708 4.6997 2.2666 3.6416 3.9677 1.9996 5.0459 2.7311 3.3918 4.2058 4.1159 4.3362 6.9646 4.3378 4.0990 4.1702 4.0485 5.2297 6.5926 4.7245 3.4335 4.8713 4.1950 3.0815 3.9521 5.1951 4.4512 3.7776 3.4072 1.2686 1.3723 5.8323 4.9708 1.4394 1.5492 1.5442 1.4705 3.1518 2.7106 1.8773 3.2283 1.3030 3.9959 1.3149 3.2825 6.6438 7.7397 2.1985 2.2913 2.0307 2.2491 2.1055 2.0964 2.1528 2.3264 1.2652 1.2570 2.2324 2.2450 1.5807 1.5320 3.7568 1.1980 1.0962 1.4253 1.6159 1.4017 1.5451 1.4868 2.0144 3.1838 3.0673 1.4329 1.4849 1.5993 1.4362 1.4482 1.2771 1.2839 1.2819 1.2944 1.3171 1.3958 9.3225 9.1722 2.6565 1.6825 1.5843 2.6238 1.5000 1.6204 1.0952 1.0936 1.1151 1.0784 1.0526 1.0818 1.2980 1.0915 1.0912 1.0973 1.7720 2.3344 7.3070 8.0122 7.0900 6.0252 6.5712 7.3520 1.0330 1.0324 1.0694 1.0691 1.0633 1.0595 1.0644 1.0575 1.1039 1.1044 1.1053 1.1071 1.0979 1.0990 1.0946 1.0948 1.0992 1.1001 1.0851 1.0854 1.0900 1.0898 1.0940 1.0941 1.1001 1.1004
irintensity: 0.0085 0.5053 0.2991 0.1838 0.1187 3.2794 0.9797 1.8316 4.2944 5.9264 5.0217 4.0733 5.8921 6.5280 4.3192 5.2268 8.4451 0.3662 5.5239 1.0872 2.0218 0.9067 2.1598 0.3256 9.8272 0.4759 0.9123 11.9127 2.4191 4.4292 11.0006 13.8013 0.2476 0.6881 0.0619 4.8984 5.1269 3.8742 0.8635 15.8068 27.8742 0.5498 0.4633 1.2748 2.9635 7.6860 3.6033 6.4684 3.5311 1.8432 22.6566 0.9774 24.4201 5.9459 5.4595 47.0309 116.8942 94.0594 3.3562 12.6154 1.9335 0.3533 2.5861 13.1707 3.0292 22.1715 20.7141 17.5908 1.9046 20.7374 0.4401 98.9829 54.4614 44.8551 1.7490 38.7717 19.2319 19.0378 3.8053 23.2418 1.4349 78.5171 1.0730 0.0294 113.9494 6.1869 18.8624 18.5629 14.5892 14.0403 7.5788 46.8900 26.0177 65.7836 3.3948 52.0965 30.6144 211.5219 124.6101 88.6225 5.1091 6.3824 34.3571 7.8396 0.3574 4.2372 2.3643 2.4347 5.7020 15.4645 8.2723 0.4540 20.1442 9.1814 18.5783 144.4323 22.6726 34.7556 19.1492 23.5099 36.5879 7.4654 17.0160 2.8704 121.9455 25.9021 58.7007 8.4767 71.5960 115.5950 395.4208 158.5836 19.6863 70.3226 16.3553 24.5208 66.3576 54.2037 25.0448 15.6246 39.9360 14.7902 82.9963 36.3190 50.6631 36.4648 14.1947 9.9702 5.8961 4.1110 3.1845 1.7300 19.4955 18.8821 0.9476 0.4786 12.9113 13.6127 10.8448 18.0266 17.2755 13.1115
temp: 298.150 k
press: 1.00000 atm
elementType: 8 8 8 8 8 8 7 7 6 6 6 6 6 6 6 6 6 6 6 6 6 6 6 6 6 6 6 6 6 6 1 1 1 1 1 1 1 1 1 1 1 1 1 1 1 1 1 1 1 1 1 1 1 1 1 1
symmnumber: 1
zpe: 1179564.3 jmol-1
zpe.correction: 0.449272 hartree
zpe.thermalcorrener: 0.477968 hartree
zpe.thermalcorrenthalpy: 0.478912 hartree
zpe.thermalcorrgfe: 0.385893 hartree
zpe.sumelectzpe: -1412.505060 hartree
zpe.sumelectthermal: -1412.476365 hartree
zpe.sumelectthermalent: -1412.475421 hartree
zpe.sumelectthermalfe: -1412.568440 hartree
dipole: -1.7311 -1.6227 -3.5026
dipole: 4.2306
quadrupole: -148.3363 -187.4470 -161.8769
quadrupole: 22.0292 -2.0064 12.7865
quadrupole: 17.5505 -21.5603 4.0098 22.0292 -2.0064 12.7865
hfenergy: -1412.9543328 hartree
pointgroup: C01 [X(C22H26N2O6)]
dipole: 0.4804476 1.5814384 0.1966038 debye
polarizability: 311.4518589|-19.232243|240.8473994|10.204977|26.7656991|261.5079239 unknown
InChI: InChI=1S/C22H26N2O6/c1-27-17-7-3-5-9-19(17)29-15-21(25)23-11-13-24(14-12-23)22(26)16-30-20-10-6-4-8-18(20)28-2/h3-10H,11-16H2,1-2H3
charge 0 multiplicity 1
56 atoms
O  1.310952 -0.517749 -3.389829
O  -1.67669 -1.455721 2.993095
O  3.423652 -0.260971 -0.691615
O  -3.838865 -1.887944 0.223752
O  3.487865 2.18643 0.636855
O  -4.774264 -0.791959 -1.9811
N  0.492626 -0.25674 -1.221866
N  -0.869876 -1.710594 0.816957
C  0.581324 0.196599 0.183754
C  -0.763497 -0.963118 -1.551623
C  0.3915 -1.00445 1.139156
C  -0.96846 -2.159995 -0.592854
C  1.477343 -0.128097 -2.18891
C  -1.844209 -1.841942 1.789444
C  2.793618 0.540465 -1.781516
C  -3.180515 -2.502662 1.387231
C  4.645495 0.25304 -0.196072
C  -4.359426 -0.587491 0.37224
C  4.706754 1.49232 0.510763
C  -4.892996 -0.009393 -0.822864
C  5.80785 -0.528385 -0.339401
C  -4.394427 0.135894 1.582983
C  5.939783 1.934891 1.042278
C  -5.478481 1.274901 -0.771251
C  7.038478 -0.091842 0.205016
C  -4.982465 1.424614 1.620471
C  7.101265 1.141557 0.887605
C  -5.527243 1.98903 0.451309
C  3.496787 3.436503 1.404689
C  -5.343936 -0.246414 -3.21564
H  -0.224568 0.935673 0.36993
H  1.554579 0.668337 0.378043
H  -0.694422 -1.306618 -2.596483
H  -1.621092 -0.268676 -1.458701
H  1.246378 -1.69838 1.024702
H  0.333274 -0.672244 2.188264
H  -1.954347 -2.603507 -0.78866
H  -0.178079 -2.91409 -0.779367
H  2.637464 1.580086 -1.435412
H  3.449711 0.529641 -2.668508
H  -3.027483 -3.551109 1.079392
H  -3.833278 -2.47893 2.277551
H  5.723944 -1.477614 -0.878044
H  -3.954142 -0.282386 2.493252
H  6.00373 2.883558 1.583784
H  -5.89647 1.725807 -1.676156
H  7.935599 -0.708413 0.090186
H  -5.005487 1.975423 2.566335
H  8.050395 1.492423 1.306591
H  -5.985297 2.983389 0.477303
H  3.821516 3.260194 2.447735
H  4.151149 4.192987 0.930833
H  2.454642 3.787751 1.393661
H  -6.433433 -0.075314 -3.11418
H  -4.845515 0.698347 -3.508909
H  -5.157714 -1.016012 -3.978802
