program: Gaussian 09
title: 000200782
version: EM64L-G09RevD.01
frameworkgroup: C1[X(C13H15ClO)]
method: RPBEPBE
basis: SDD
operation: Freq
keyword: #p
keyword: freq=noraman
keyword: PBEPBE/SDD
title: #p freq=noraman PBEPBE/SDD
converged: YES YES NO NO
title: Mulliken charges:
elementType: Cl O C C C C C C C C C C C C C H H H H H H H H H H H H H H H
charge: -0.064492 -0.199740 -0.135403 -0.421325 -0.407784 -0.392976 -0.519227 -0.632066 0.162615 0.517985 -0.413726 -0.391979 -0.218246 -0.218909 -0.106456 0.243107 0.198437 0.235918 0.218327 0.193871 0.211468 0.216642 0.244050 0.219714 0.226243 0.246957 0.240635 0.239172 0.253823 0.253366
chargesum: 0.00000
title: Mulliken charges with hydrogens summed into heavy atoms:
elementType: Cl O C C C C C C C C C C C C C
charge: -0.064492 -0.199740 0.107704 0.013030 0.004413 0.035134 -0.055464 -0.158865 0.162615 0.517985 -0.173091 -0.152807 0.035577 0.034457 -0.106456
polarizability: 2.00510974e+02 -1.68207938e+01 1.16253037e+02 5.08838359e+00 7.36661814e+00 1.21496379e+02
1716.lowfreq: -6.0173 -0.0011 0.0004 0.0017 4.2244 9.4058 27.2397 38.5679 41.9517
frequency: 26.9554 38.4033 41.9296 74.2788 121.3616 145.6810 190.9962 232.1172 285.5984 295.4919 304.3147 364.6898 382.2887 407.8423 411.0978 418.3039 483.8395 526.3781 549.0913 627.3602 635.8237 655.4127 708.7865 752.0052 789.4817 808.8793 830.4226 835.0846 857.8980 865.3924 880.4867 920.3249 948.1414 964.6801 965.8177 999.9909 1033.9400 1054.9061 1063.5516 1071.8074 1082.9323 1104.8284 1110.9283 1122.1266 1169.3754 1182.9035 1214.2406 1222.3382 1238.7742 1251.1612 1271.7342 1278.1599 1297.0703 1302.2231 1323.6500 1336.8253 1341.3582 1348.9774 1375.6262 1394.7819 1447.3834 1464.8849 1467.3871 1468.5632 1477.2035 1477.8046 1585.7281 1600.2066 1624.4240 2937.4158 2970.0939 2972.6490 2973.6013 2984.2577 3002.6274 3036.8108 3041.5009 3050.1683 3058.8524 3074.6548 3125.3369 3130.7924 3167.1221 3170.4978
redmass: 4.4455 3.9705 5.9192 4.2596 4.4899 3.0946 8.5560 4.5146 4.1655 2.0627 2.9996 2.2237 7.0450 2.9826 2.9621 3.6930 2.2970 3.7648 2.7733 6.8618 5.0898 3.1434 3.5231 2.4944 3.1066 1.5433 1.2880 1.7655 2.4477 2.5423 1.4641 1.6449 1.4044 2.1750 1.3945 4.2680 1.6441 1.6830 1.8023 2.6645 1.5448 2.3062 1.4491 1.9570 1.4208 1.1255 2.3135 1.4426 1.4809 1.2507 1.4593 1.3004 1.2956 1.3249 1.4290 1.4898 1.5511 1.5750 6.7038 2.6645 1.0906 1.0861 1.0878 1.1477 1.3684 1.5913 7.3442 6.3581 9.7744 1.0799 1.0665 1.0635 1.0625 1.0615 1.0605 1.0960 1.1004 1.1028 1.1016 1.0972 1.0897 1.0897 1.0950 1.0960
irintensity: 1.6841 0.0855 0.9284 2.2611 0.4751 0.8487 4.4701 0.7453 0.3030 0.2201 1.2010 0.8324 18.8972 0.1300 0.2935 1.8168 4.8383 18.4811 10.3931 0.1182 9.9565 5.7597 5.1119 7.2391 15.2696 19.6136 3.5965 31.3323 3.2778 16.6691 8.1179 3.4620 0.9622 3.4341 0.4437 37.5341 8.1477 9.6949 8.1893 34.5796 4.6403 3.1348 11.3502 34.2905 1.6177 0.8596 0.6440 2.9823 10.4355 5.6225 37.4963 0.4934 1.1636 10.7817 5.5398 0.2700 3.3234 2.6158 0.0085 4.1111 14.4637 16.7823 12.7686 16.0940 25.9080 57.3391 1.0092 1.0030 157.1068 4.9925 12.9832 11.9278 43.2366 38.2654 14.3141 44.6992 32.4526 50.6498 19.9109 29.0293 11.3001 12.9821 7.4434 0.6415
temp: 298.150 k
press: 1.00000 atm
elementType: 17 8 6 6 6 6 6 6 6 6 6 6 6 6 6 1 1 1 1 1 1 1 1 1 1 1 1 1 1 1
symmnumber: 1
zpe: 645091.2 jmol-1
zpe.correction: 0.245702 hartree
zpe.thermalcorrener: 0.259598 hartree
zpe.thermalcorrenthalpy: 0.260542 hartree
zpe.thermalcorrgfe: 0.202898 hartree
zpe.sumelectzpe: -1038.562592 hartree
zpe.sumelectthermal: -1038.548697 hartree
zpe.sumelectthermalent: -1038.547752 hartree
zpe.sumelectthermalfe: -1038.605396 hartree
dipole: 1.8962 2.5332 -0.8258
dipole: 3.2703
quadrupole: -109.0570 -102.7858 -89.1471
quadrupole: 12.0379 -4.6737 5.1777
quadrupole: -8.7270 -2.4559 11.1829 12.0379 -4.6737 5.1777
hfenergy: -1038.8082943 hartree
pointgroup: C01 [X(C13H15Cl1O1)]
dipole: -0.8047749 -0.8519948 -0.5308974 debye
polarizability: 198.2156981|-19.1742958|121.6551576|-11.7418893|-6.7235286|118.3895337 unknown
InChI: InChI=1S/C13H15ClO/c14-12-7-5-10(6-8-12)9-11-3-1-2-4-13(11)15/h5-8,11H,1-4,9H2
charge 0 multiplicity 1
30 atoms
Cl 5.352808 -0.848466 -0.662146
O  -3.012212 1.899488 0.910002
C  -1.428776 0.264388 -0.013552
C  -1.548929 -1.269475 0.249496
C  -2.635007 -1.925649 -0.631762
C  -4.010939 -1.258027 -0.411837
C  -3.937204 0.275735 -0.665075
C  -0.353053 0.954887 0.867887
C  -2.811936 0.91584 0.14732
C  1.059972 0.520485 0.512972
C  1.765624 -0.424377 1.301192
C  1.703845 1.041889 -0.640544
C  3.069748 -0.848109 0.954607
C  3.005353 0.633914 -1.007059
C  3.667847 -0.311461 -0.200197
H  -1.147984 0.384423 -1.084409
H  -1.795098 -1.42795 1.320091
H  -0.564743 -1.741094 0.071641
H  -2.698411 -3.007396 -0.40675
H  -2.346976 -1.837591 -1.699598
H  -4.34699 -1.438089 0.628676
H  -4.773266 -1.703459 -1.0782
H  -4.887856 0.777607 -0.415939
H  -3.730703 0.44584 -1.742467
H  -0.572988 0.736181 1.929391
H  -0.464763 2.048964 0.752269
H  1.295883 -0.832739 2.203884
H  1.187582 1.787752 -1.257424
H  3.606473 -1.575338 1.570704
H  3.495696 1.045424 -1.894073
