program: Gaussian 09
title: 000200795
version: EM64L-G09RevD.01
frameworkgroup: C1[X(C15H19N3O)]
method: RPBEPBE
basis: SDD
operation: Freq
keyword: #p
keyword: freq=noraman
keyword: PBEPBE/SDD
title: #p freq=noraman PBEPBE/SDD
converged: YES YES NO NO
title: Mulliken charges:
elementType: O N N N C C C C C C C C C C C C C C C H H H H H H H H H H H H H H H H H H H
charge: -0.275262 -0.198999 -0.083593 -0.044610 -0.350399 -0.359443 0.139530 0.275855 0.031363 -0.363969 0.350104 -0.616474 -0.619693 -0.786319 -0.371716 -0.365754 -0.247381 -0.230512 -0.238374 0.255124 0.235998 0.196209 0.253891 0.234847 0.222911 0.225944 0.191178 0.221702 0.236794 0.188808 0.250957 0.252675 0.216026 0.216958 0.269923 0.227083 0.227760 0.230858
chargesum: 0.00000
title: Mulliken charges with hydrogens summed into heavy atoms:
elementType: O N N N C C C C C C C C C C C C C C C
charge: -0.275262 -0.198999 -0.083593 -0.044610 0.140723 0.090656 0.139530 0.275855 0.031363 -0.129122 0.350104 0.023560 0.027611 -0.066661 -0.154758 -0.095831 -0.020298 -0.002752 -0.007517
polarizability: 2.85840772e+02 -2.48800167e+01 2.21779529e+02 9.26082093e+00 4.62101009e+00 1.02397120e+02
1716.lowfreq: -0.0002 0.0005 0.0006 2.0752 3.4962 6.5196 17.9731 21.4610 37.1128
frequency: 17.8429 21.2172 37.0714 58.0517 70.4125 87.5170 116.7514 121.3645 138.0907 192.6011 215.4595 222.9903 232.1920 252.9775 256.8567 300.5458 316.0470 336.3520 350.5460 378.7359 400.3859 405.6524 429.2611 476.5943 498.0380 515.3085 583.5231 591.7693 617.1277 634.4838 657.6487 697.1093 742.6462 747.7865 781.3907 796.1592 823.9930 850.1872 895.5774 901.4290 928.8040 951.9710 981.4128 984.4290 989.9040 1001.9114 1022.9201 1029.3905 1035.3299 1038.0222 1046.3875 1060.0452 1079.3354 1088.1965 1094.0090 1126.9066 1143.8229 1173.1939 1193.5328 1208.1013 1228.1439 1247.4404 1272.4320 1289.7881 1316.5342 1319.2132 1323.8728 1328.4139 1370.3404 1382.1694 1384.5162 1401.4506 1421.7468 1423.8469 1438.4413 1444.2922 1444.9013 1461.8603 1463.1435 1470.0819 1477.1220 1477.3628 1483.7127 1487.1805 1493.5355 1571.4855 1587.3604 1612.7188 1628.8418 2852.2320 2857.3540 2873.4772 2986.0111 3020.9606 3024.8962 3050.1142 3056.0726 3063.6844 3079.6822 3083.4641 3101.0629 3126.1369 3129.4269 3134.3749 3145.7025 3152.0069 3160.8033 3171.7032
redmass: 3.7089 3.6776 2.8211 3.9737 5.4742 2.5368 4.1653 1.1205 3.4732 2.6348 3.4037 1.1744 1.5737 2.1459 3.0260 4.9848 2.8118 3.6809 3.8215 5.0658 2.7819 2.6132 2.5219 3.5563 4.8452 5.5935 5.8522 4.3371 6.3636 3.9469 5.7826 1.7570 5.0396 3.5559 2.0047 1.4500 4.3629 1.2664 1.4514 6.9760 1.4657 3.9469 1.3968 2.5714 4.7564 1.3307 2.5562 2.1362 2.0021 1.6066 1.5447 2.6447 1.6689 1.4532 1.5316 1.8518 1.7466 1.0589 1.1653 2.0528 2.6270 6.1472 2.5773 1.5493 1.3464 1.6673 1.7172 1.6662 1.3246 5.8907 2.9074 1.2862 1.1495 2.1893 1.2348 1.1341 1.0835 1.1208 1.0495 1.0564 1.6025 1.7278 1.1217 1.0549 2.5163 7.9815 6.1181 5.9769 6.9042 1.0567 1.0628 1.0642 1.0367 1.0732 1.0724 1.0811 1.0658 1.0957 1.1006 1.1006 1.1010 1.0847 1.1070 1.0883 1.0934 1.0916 1.0961 1.0993
irintensity: 0.0100 0.4491 0.2321 3.1388 0.3033 2.3941 1.9782 1.3574 1.9173 1.1710 0.3622 1.0216 0.2370 2.6583 1.1944 3.4733 2.9489 16.3212 2.6299 8.5767 0.0724 0.8271 2.4820 3.6643 9.7717 4.8580 25.4884 0.8623 0.1070 17.3717 3.3295 47.6571 1.2956 4.3328 58.6111 2.1196 10.0621 0.7518 10.9852 15.9035 3.7544 21.0029 1.5398 29.3723 6.0557 0.4566 2.8465 7.0607 23.4752 23.3748 10.5330 58.0301 1.4727 18.9641 23.0605 59.5196 19.7217 0.0693 1.6455 3.9353 4.9069 12.6808 23.6874 8.6383 8.7924 31.7402 4.1834 0.3576 7.5695 1.0563 3.5646 40.3544 3.5204 13.5998 5.0593 15.0350 7.1877 14.1652 11.9659 8.4371 21.2269 14.0549 13.1018 11.6883 29.8913 303.8990 5.9606 11.4019 52.5379 67.3490 100.7058 177.7820 13.5965 41.3727 48.5153 6.2528 18.3139 9.1462 20.8801 57.3629 15.0564 3.8652 3.6759 6.9306 13.1361 25.8824 28.6172 15.6779
temp: 298.150 k
press: 1.00000 atm
elementType: 8 7 7 7 6 6 6 6 6 6 6 6 6 6 6 6 6 6 6 1 1 1 1 1 1 1 1 1 1 1 1 1 1 1 1 1 1 1
symmnumber: 1
zpe: 821047.6 jmol-1
zpe.correction: 0.312721 hartree
zpe.thermalcorrener: 0.331514 hartree
zpe.thermalcorrenthalpy: 0.332458 hartree
zpe.thermalcorrgfe: 0.263347 hartree
zpe.sumelectzpe: -821.046744 hartree
zpe.sumelectthermal: -821.027950 hartree
zpe.sumelectthermalent: -821.027006 hartree
zpe.sumelectthermalfe: -821.096118 hartree
dipole: 2.4478 -1.2241 1.3517
dipole: 3.0524
quadrupole: -105.0979 -104.8269 -117.1171
quadrupole: 12.1865 -2.8734 2.1054
quadrupole: 3.9161 4.1871 -8.1032 12.1865 -2.8734 2.1054
hfenergy: -821.3594644 hartree
pointgroup: C01 [X(C15H19N3O1)]
dipole: 0.9944971 0.4851101 -0.4666815 debye
polarizability: 288.1784457|22.2702373|217.7121548|-2.8635466|16.3159386|104.1268202 unknown
InChI: InChI=1S/C15H19N3O/c1-12-11-14(13-7-5-4-6-8-13)16-18(15(12)19)10-9-17(2)3/h4-8,11H,9-10H2,1-3H3
charge 0 multiplicity 1
38 atoms
O  -2.439143 -2.421756 0.045774
N  -1.094428 -0.534498 0.438643
N  -4.178628 1.653116 0.058737
N  0.088819 0.160685 0.440458
C  -2.281738 0.246796 0.854154
C  -3.047747 0.807407 -0.371747
C  -1.279464 -1.894855 0.037707
C  -0.042765 -2.577916 -0.367081
C  1.20521 -0.492974 0.047563
C  1.151556 -1.876908 -0.360018
C  2.467585 0.297509 0.062209
C  -3.776479 3.02091 0.440073
C  -5.31406 1.643641 -0.884464
C  -0.176369 -4.01697 -0.787984
C  3.7394 -0.328381 -0.048045
C  2.42026 1.713736 0.195284
C  4.925166 0.437789 -0.032358
C  3.604088 2.476563 0.211988
C  4.865287 1.843718 0.095835
H  -2.957278 -0.415889 1.416858
H  -1.91676 1.057414 1.502918
H  -2.328892 1.358366 -1.029395
H  -3.441278 -0.049224 -0.946567
H  2.066936 -2.377881 -0.689071
H  -2.988677 2.990864 1.21278
H  -4.642868 3.557365 0.866589
H  -3.387096 3.61926 -0.423065
H  -6.164278 2.195691 -0.444136
H  -5.640065 0.604325 -1.063359
H  -5.078347 2.110899 -1.87416
H  -0.871872 -4.106626 -1.642878
H  -0.625554 -4.615265 0.026036
H  0.797131 -4.453992 -1.065643
H  3.819717 -1.417676 -0.128161
H  1.442787 2.19628 0.285735
H  5.895213 -0.064898 -0.115019
H  3.545814 3.566186 0.312064
H  5.786022 2.437292 0.106548
