program: Gaussian 09
title: 000017045
version: EM64L-G09RevD.01
frameworkgroup: C1[X(C5H11NO)]
method: RPBEPBE
basis: SDD
operation: Freq
keyword: #p
keyword: freq=noraman
keyword: PBEPBE/SDD
title: #p freq=noraman PBEPBE/SDD
converged: YES YES NO NO
title: Mulliken charges:
elementType: O N C C C C C H H H H H H H H H H H
charge: -0.280610 -0.352807 0.301019 -0.744119 -0.679826 -0.679758 -0.050902 0.218255 0.230200 0.218091 0.267064 0.206823 0.203827 0.206816 0.203819 0.267080 0.303414 0.161613
chargesum: 0.00000
title: Mulliken charges with hydrogens summed into heavy atoms:
elementType: O N C C C C C
charge: -0.280610 -0.049393 0.301019 -0.077573 -0.002111 -0.002043 0.110712
polarizability: 7.29955959e+01 1.39823794e+00 6.44235686e+01 4.87291168e-04 7.92265703e-04 5.33416428e+01
1716.lowfreq: -13.3917 -5.3795 -0.0008 -0.0004 -0.0004 7.3818 88.9610 192.3685 199.6309
frequency: 88.9603 192.3685 199.5960 244.2504 262.3173 264.7183 306.5681 345.9787 395.9363 415.1812 479.8871 541.3091 682.8592 800.6987 879.2842 915.3073 927.0319 952.4095 963.6522 1035.8764 1036.7472 1163.9460 1228.0911 1235.7239 1256.2664 1372.1523 1372.9565 1374.3554 1398.7347 1450.2752 1451.5652 1466.9998 1472.9138 1485.4578 1486.1082 1503.2705 1639.5996 2903.9695 2973.7628 2984.3064 2988.5632 3065.4190 3079.4673 3083.0519 3093.5604 3104.2804 3108.4617 3521.7363
redmass: 3.7541 4.6672 1.0236 1.9002 1.0450 1.1205 2.7955 2.3049 2.2869 2.6744 3.3738 1.1428 4.1585 4.3387 2.4378 1.6973 1.6549 1.2118 1.5855 1.3821 1.4402 1.9168 2.3539 3.0560 3.8760 1.2047 1.2217 1.2115 1.2253 1.4291 1.0468 1.0520 1.0476 1.0529 1.2275 1.0642 5.3525 1.0853 1.0364 1.0353 1.0361 1.1002 1.1002 1.0995 1.0980 1.1003 1.0996 1.0780
irintensity: 12.7751 11.5973 0.4282 23.7243 0.0142 1.0287 2.9726 7.8097 0.9187 1.3672 31.9968 48.2523 2.9454 3.6373 0.6849 0.4092 3.7913 0.7049 0.2358 0.0004 0.1446 4.9165 48.7472 23.9180 41.9503 31.4990 19.1954 39.2551 25.6042 147.4554 0.6813 4.5109 0.4870 8.9886 28.0318 14.9190 218.6676 140.1392 26.1955 36.2599 16.7541 27.1126 32.4820 20.7405 54.5389 1.9952 18.9051 12.5045
temp: 298.150 k
press: 1.00000 atm
elementType: 8 7 6 6 6 6 6 1 1 1 1 1 1 1 1 1 1 1
symmnumber: 1
zpe: 407902.3 jmol-1
zpe.correction: 0.155362 hartree
zpe.thermalcorrener: 0.163978 hartree
zpe.thermalcorrenthalpy: 0.164922 hartree
zpe.thermalcorrgfe: 0.123211 hartree
zpe.sumelectzpe: -326.533658 hartree
zpe.sumelectthermal: -326.525042 hartree
zpe.sumelectthermalent: -326.524098 hartree
zpe.sumelectthermalfe: -326.565809 hartree
dipole: 3.2176 2.8420 0.0011
dipole: 4.2930
quadrupole: -50.2778 -40.1296 -44.5066
quadrupole: -5.1411 -0.0012 0.0011
quadrupole: -5.3065 4.8417 0.4647 -5.1411 -0.0012 0.0011
hfenergy: -326.6890195 hartree
pointgroup: C01 [X(C5H11N1O1)]
dipole: -1.2897645 1.0899951 0.0337018 debye
dipolederiv: -0.8198175 0.1220778 0.0032423 0.4649033 -0.7676634 -0.0118216 0.0147096 -0.0124602 -0.3883068 -1.2130129 0.0765586 0.0013346 0.0766781 -0.3329956 0.0062882 0.0014206 0.0062643 -0.5220711 0.5522291 0.1319241 0.0046649 0.2423341 0.367216 0.0003585 0.008431 0.0000485 0.3735723 -0.0942427 0.0215884 0.0005435 0.0348862 -0.0060925 -0.0022721 0.0010904 -0.0021295 0.061501 -0.0831294 0.0445422 0.02681 -0.0044398 -0.0264555 -0.0619995 0.0179691 -0.0981328 -0.0772492 -0.0830991 0.0457715 -0.0237741 -0.003556 -0.037408 0.0647942 -0.0184022 0.1011515 -0.0664299 1.4832045 -0.2113781 -0.00442 -0.4659733 0.9435046 0.0258434 -0.0129268 0.0263533 0.148948 0.081888 0.0044835 0.0093276 0.049433 -0.0186827 0.1202769 -0.026129 0.1429316 -0.0778965 -0.0561759 -0.0809468 -0.0026617 -0.1513006 -0.0073377 -0.0036252 -0.0048674 -0.0035935 0.1041979 0.0819374 0.0050654 -0.0088935 0.0478314 -0.0023651 -0.115429 0.0293341 -0.1381058 -0.094339 -0.0058356 0.1106406 0.0475789 0.0839219 0.0608625 -0.0142346 0.0109772 0.0118119 0.0992135 0.1026684 0.0089546 -0.0242047 0.0216465 -0.0140313 0.1397882 -0.0109777 0.0821931 -0.108692 -0.0604955 -0.1498115 -0.0174816 -0.1472921 -0.013579 -0.0211537 0.000408 0.0046136 0.0760662 0.102452 0.007701 0.0259679 0.0215585 0.0005409 -0.1322999 0.0136192 -0.0747954 -0.1229997 -0.0603071 -0.1505909 0.0066516 -0.1469259 -0.0144597 0.014335 -0.0110384 -0.0115274 0.076767 -0.0056643 0.1135558 -0.0406413 0.0843657 0.0610456 0.0119883 -0.0058379 -0.0139815 0.0990611 0.1308751 -0.0003934 -0.0003481 -0.0159846 0.0622949 -0.007943 -0.0009857 -0.0079033 0.3004228 -0.0534745 -0.0997427 -0.0036963 -0.1920863 -0.2543939 -0.012894 -0.0067943 -0.0127383 0.1182344 unknown
polarizability: 73.051925|-1.2123835|64.3549228|-0.0018903|0.36717|53.3539596 unknown
InChI: InChI=1S/C5H11NO/c1-5(2,3)6-4-7/h4,6H,1-3H3
charge 0 multiplicity 1
18 atoms
O  2.217182 -0.467842 -0.011928
N  0.345239 0.960252 0.032218
C  -0.757798 -0.055739 -0.004027
C  -2.087884 0.735164 0.020029
C  -0.652409 -0.892519 -1.306339
C  -0.657476 -0.978048 1.239555
C  1.695548 0.683924 0.025632
H  -2.173999 1.401371 -0.859413
H  -2.940526 0.035251 -0.002441
H  -2.174794 1.344665 0.939599
H  0.313448 -1.422496 -1.341984
H  -0.73297 -0.242795 -2.196702
H  -1.468691 -1.636693 -1.341634
H  -0.74326 -0.389915 2.171277
H  -1.473072 -1.723522 1.220456
H  0.308888 -1.508237 1.243909
H  0.071727 1.945782 0.064283
H  2.309346 1.616498 0.058211
