program: Gaussian 09
title: 000200783
version: EM64L-G09RevD.01
frameworkgroup: C1[X(C9H13BrN5OP)]
method: RPBEPBE
basis: SDD
operation: Freq
keyword: #p
keyword: freq=noraman
keyword: PBEPBE/SDD
title: #p freq=noraman PBEPBE/SDD
converged: YES YES NO NO
title: Mulliken charges:
elementType: Br P O N N N N N C C C C C C C C C H H H H H H H H H H H H H
charge: 0.013504 1.276178 -0.602343 -0.415177 -0.435862 -0.767197 -0.081038 -0.051891 -0.392808 -0.372963 -0.382102 -0.389708 0.445078 -0.434591 0.282126 -0.371497 -0.764562 0.250472 0.267414 0.262066 0.249285 0.298193 0.242278 0.251809 0.252487 0.358607 0.248896 0.250589 0.261838 0.250918
chargesum: 0.00000
title: Mulliken charges with hydrogens summed into heavy atoms:
elementType: Br P O N N N N N C C C C C C C C C
charge: 0.013504 1.276178 -0.602343 -0.415177 -0.435862 -0.408589 -0.081038 -0.051891 0.125078 0.138388 0.158369 0.114588 0.445078 -0.434591 0.282126 -0.122601 -0.001217
polarizability: 2.13081198e+02 -4.19459491e+00 1.88623827e+02 4.13003199e+00 1.13034000e+01 1.29076974e+02
1716.lowfreq: -8.2559 -4.4401 0.0008 0.0009 0.0012 6.3973 25.8633 31.8192 38.8566
frequency: 25.8039 31.7470 38.8139 58.4614 79.9235 85.3361 99.1620 134.7511 146.1271 159.3618 163.7985 201.0685 220.1951 225.7116 241.9102 254.5274 287.8362 311.1293 351.1186 366.7748 405.8228 453.4282 505.6702 513.4558 533.9442 588.6866 603.9354 658.6193 663.2584 736.5173 769.5498 793.1282 808.3229 809.3054 824.3183 844.1841 883.1718 912.8594 933.9993 937.9281 959.4704 994.9691 1006.0641 1018.2971 1046.1554 1047.0171 1073.2163 1084.7772 1113.7824 1116.4751 1117.4095 1142.7438 1149.0796 1153.6103 1223.2455 1230.5047 1237.7183 1275.9608 1310.5510 1337.9943 1393.7447 1409.2899 1434.3289 1445.1397 1450.1328 1455.9005 1461.9892 1466.0991 1467.1607 1484.4051 1542.6454 2991.7830 3070.2860 3076.9517 3077.2637 3082.4769 3084.4623 3128.8833 3157.6630 3185.2018 3187.3740 3202.3146 3204.2155 3488.0780
redmass: 6.6285 3.8429 3.5891 3.8996 4.3356 6.0877 4.0296 1.0302 5.4822 3.9269 4.4597 4.3843 5.3071 4.9019 5.7526 4.8684 6.6306 7.9258 5.0480 5.1186 4.3767 6.3653 3.6431 7.0924 6.0802 2.8034 4.1738 2.1726 4.3878 6.7101 7.0022 8.9468 1.0892 1.0994 6.0779 8.8637 4.5251 4.7702 2.9716 1.4736 5.1743 1.0586 1.1897 4.8267 1.5868 2.3637 1.2648 1.2583 1.3114 1.3142 1.3028 1.2690 1.4003 1.3918 6.7499 4.3488 3.3733 3.8085 2.8355 1.6676 1.2229 1.7816 1.3287 1.3717 1.0785 2.7472 1.0454 1.1667 1.2989 2.1934 7.5923 1.0381 1.0966 1.0501 1.0500 1.0579 1.0599 1.0991 1.0920 1.1180 1.1180 1.1184 1.1177 1.0755
irintensity: 0.7809 1.0736 1.3249 3.0819 0.5212 1.0326 1.2421 0.6309 7.0395 6.5628 5.2469 9.7340 1.2532 4.2489 9.5768 1.6000 3.4183 0.2587 5.9907 8.5164 16.0455 49.3727 4.4173 78.8153 2.0451 13.6122 14.3065 85.2225 64.5274 131.0243 25.2739 3.1843 32.6210 30.6519 7.6415 15.2690 167.9711 119.4515 53.7909 7.8082 90.8970 1.2526 15.2865 119.8071 8.3902 16.2554 4.2450 5.3512 5.6430 8.0069 8.6397 7.9464 1.4508 0.3902 64.6959 13.1952 54.7722 84.1453 2.3031 11.7343 29.6054 14.6128 48.0197 17.8009 6.6145 100.2377 17.0347 2.7110 29.4051 0.9495 702.6963 5.4144 9.5044 16.2434 16.9855 45.0656 25.2547 8.1282 13.4707 12.2189 1.1029 4.6694 9.5392 54.7397
temp: 298.150 k
press: 1.00000 atm
elementType: 35 15 8 7 7 7 7 7 6 6 6 6 6 6 6 6 6 1 1 1 1 1 1 1 1 1 1 1 1 1
symmnumber: 1
zpe: 581687.1 jmol-1
zpe.correction: 0.221553 hartree
zpe.thermalcorrener: 0.239879 hartree
zpe.thermalcorrenthalpy: 0.240823 hartree
zpe.thermalcorrgfe: 0.172500 hartree
zpe.sumelectzpe: -1053.040188 hartree
zpe.sumelectthermal: -1053.021862 hartree
zpe.sumelectthermalent: -1053.020918 hartree
zpe.sumelectthermalfe: -1053.089241 hartree
dipole: 0.7342 1.6733 1.4632
dipole: 2.3409
quadrupole: -111.2852 -119.5585 -114.7960
quadrupole: -11.6665 -8.9786 -10.3784
quadrupole: 3.9280 -4.3453 0.4172 -11.6665 -8.9786 -10.3784
hfenergy: -1053.2617411 hartree
pointgroup: C01 [X(C9H13Br1N5O1P1)]
dipole: -0.5136713 0.2308618 -0.728746 debye
polarizability: 209.9924681|0.9537216|162.8443933|-10.9083907|-32.9138487|157.9451383 unknown
InChI: InChI=1S/C9H13BrN5OP/c1-7-8(10)9(12-6-11-7)13-17(16,14-2-3-14)15-4-5-15/h6,13H,2-5H2,1H3
charge 0 multiplicity 1
30 atoms
Br -2.395866 -1.6090 2.402267
P  2.023061 -0.456735 0.630485
O  2.771495 -1.232236 1.813111
N  2.002095 -1.210172 -0.988008
N  2.683473 1.112266 0.262252
N  0.293682 -0.493495 1.12022
N  -0.669233 0.906462 -0.527384
N  -3.082818 1.085275 -0.793635
C  2.243257 -2.709563 -1.041031
C  3.323242 -1.754634 -1.510765
C  2.247967 2.09657 -0.782493
C  2.168953 2.447924 0.700668
C  -0.830197 0.014116 0.504754
C  -2.154724 -0.345078 0.915568
C  -3.274162 0.204331 0.254902
C  -1.79706 1.380223 -1.118577
C  -4.699395 -0.11946 0.62255
H  1.617494 -3.231173 -1.770339
H  2.419125 -3.230583 -0.091204
H  4.211659 -1.651395 -0.87572
H  3.477552 -1.581686 -2.579564
H  1.297959 1.894034 -1.287367
H  3.07159 2.485807 -1.389688
H  2.918003 3.09949 1.160292
H  1.16415 2.493833 1.1392
H  0.151326 -1.069016 1.958833
H  -1.652286 2.081706 -1.946322
H  -4.917379 0.164591 1.668445
H  -5.373635 0.428509 -0.051868
H  -4.897723 -1.20361 0.537917
