program: Gaussian 09
title: 000200781
version: EM64L-G09RevD.01
frameworkgroup: C1[X(C15H17ClO3)]
method: RPBEPBE
basis: SDD
operation: Freq
keyword: #p
keyword: freq=noraman
keyword: PBEPBE/SDD
title: #p freq=noraman PBEPBE/SDD
converged: YES YES NO NO
title: Mulliken charges:
elementType: Cl O O O C C C C C C C C C C C C C C C H H H H H H H H H H H H H H H H H
charge: -0.080829 -0.184745 -0.419978 -0.226486 0.350029 -0.541124 -0.460252 -0.519440 0.091732 -0.674475 -0.505185 -0.503063 0.656026 -0.335884 -0.379669 0.175306 -0.232520 -0.247151 -0.228299 0.225258 0.228343 0.229927 0.224548 0.270876 0.254821 0.250153 0.234482 0.242054 0.263237 0.261885 0.248248 0.231889 0.255084 0.231146 0.235247 0.378810
chargesum: 0.00000
title: Mulliken charges with hydrogens summed into heavy atoms:
elementType: Cl O O O C C C C C C C C C C C C C C C
charge: -0.080829 -0.184745 -0.041168 -0.226486 0.350029 -0.087523 -0.005777 0.006257 0.091732 -0.189840 0.000106 0.007070 0.656026 -0.335884 -0.147780 0.175306 0.022564 -0.016005 0.006948
polarizability: 1.87518773e+02 7.46623933e+00 1.99151586e+02 1.05297215e+01 -1.10643570e+01 1.23873897e+02
1716.lowfreq: -9.4726 -0.0019 -0.0014 -0.0013 8.2163 13.4954 16.8427 24.6116 36.1776
frequency: 15.2816 24.5195 36.1036 65.7021 76.3334 95.1625 98.6863 112.3343 133.1413 156.4404 180.2712 208.6829 245.6789 260.6057 284.1601 317.2172 359.0353 379.7328 423.8843 428.5001 451.3546 497.6892 512.1912 530.0611 541.6248 554.8080 588.8966 615.0526 622.9612 660.1109 663.6465 690.7053 731.2159 754.1375 767.4304 806.1494 824.7778 834.6118 866.7413 871.0367 890.2402 916.5150 942.8703 947.0084 968.6106 983.8524 1011.4629 1015.9057 1034.4940 1036.2371 1040.7637 1066.0161 1073.3453 1110.2463 1124.9548 1141.2357 1165.3047 1167.6095 1175.0093 1207.7308 1212.7462 1220.7610 1239.8172 1248.4664 1270.1847 1283.4431 1295.5197 1301.2922 1317.6937 1320.9252 1322.7481 1369.1220 1377.6117 1425.6284 1427.2717 1446.8961 1464.3531 1465.8130 1474.0463 1479.9706 1485.1237 1574.9942 1608.1466 1650.2871 1668.6555 2981.1353 2985.6897 2991.0235 2999.5119 3003.3307 3009.8290 3046.8581 3053.7781 3061.8142 3071.5403 3075.5715 3082.9462 3127.5774 3143.0556 3160.1980 3176.3039 3505.9546
redmass: 8.4021 7.5850 7.2907 5.8107 4.5001 6.4899 3.3076 3.0048 5.4978 3.7258 2.7593 4.3922 6.5496 3.9813 2.7722 3.9010 2.7944 4.0829 3.6695 2.8902 3.2248 3.5742 3.2204 2.2321 2.9090 4.3603 3.5304 3.5385 2.9893 2.4746 2.4348 3.7663 3.6629 1.2854 1.3806 2.0669 2.3467 2.6322 1.9785 2.1311 2.2112 2.4905 1.9142 1.4660 2.6933 1.3294 1.9532 5.2810 2.1510 1.9936 2.1327 1.9036 2.6165 2.1132 2.6374 1.6869 1.3488 1.5979 1.1482 1.4335 2.3970 1.4263 1.4748 1.4459 1.4106 1.4168 1.2753 1.3413 1.4527 1.6523 1.4481 1.7347 5.2166 1.0807 2.1917 1.1038 2.3910 1.0942 1.0943 1.0858 1.0915 6.0192 7.2193 12.2638 8.3935 1.0615 1.0648 1.0660 1.0619 1.0614 1.0647 1.0997 1.0965 1.0988 1.0971 1.0981 1.1010 1.0866 1.0895 1.0951 1.0993 1.0638
irintensity: 0.9933 0.7362 0.8335 1.0049 3.8880 0.0417 1.9055 0.0662 0.9986 0.8188 0.4298 3.2652 0.2820 3.3202 1.7877 1.0701 2.2908 2.5185 17.6786 3.6011 7.7577 16.9336 6.7545 7.8691 29.0803 10.5215 11.3230 14.0693 1.6697 49.2735 71.3610 8.6758 2.0582 71.4295 23.4503 15.9947 9.0026 8.8566 5.2937 1.9513 2.2048 3.1906 8.8107 1.9193 2.7081 0.0377 83.9446 18.7214 0.9412 107.7560 13.7615 124.7101 31.1428 14.8334 2.2164 42.2269 12.9250 10.7013 0.7968 1.2496 0.3622 6.8460 17.4999 1.3271 4.2207 7.4105 2.6581 7.1010 3.1733 20.0722 9.6323 43.9820 0.2258 30.6493 18.4620 12.0379 28.0704 6.4524 7.3573 32.2269 10.2449 7.8520 1.5543 102.3002 221.8696 35.3995 7.0458 9.2674 25.4893 6.3124 24.1431 32.4626 1.5453 8.8302 17.6740 22.9818 38.0462 6.9290 12.0405 16.6579 11.7676 21.4525
temp: 298.150 k
press: 1.00000 atm
elementType: 17 8 8 8 6 6 6 6 6 6 6 6 6 6 6 6 6 6 6 1 1 1 1 1 1 1 1 1 1 1 1 1 1 1 1 1
symmnumber: 1
zpe: 752054.7 jmol-1
zpe.correction: 0.286443 hartree
zpe.thermalcorrener: 0.304816 hartree
zpe.thermalcorrenthalpy: 0.305760 hartree
zpe.thermalcorrgfe: 0.237288 hartree
zpe.sumelectzpe: -1266.127668 hartree
zpe.sumelectthermal: -1266.109295 hartree
zpe.sumelectthermalent: -1266.108351 hartree
zpe.sumelectthermalfe: -1266.176823 hartree
dipole: -1.0420 -0.2428 -3.2477
dipole: 3.4194
quadrupole: -117.4289 -101.7578 -129.8245
quadrupole: 0.2238 7.0775 -4.2470
quadrupole: -1.0918 14.5792 -13.4874 0.2238 7.0775 -4.2470
hfenergy: -1266.4141108 hartree
pointgroup: C01 [X(C15H17Cl1O3)]
dipole: 0.4699203 -0.0689482 1.2586669 debye
polarizability: 188.6651433|-7.0949536|199.1156275|7.413777|10.5928907|122.7634847 unknown
InChI: InChI=1S/C15H17ClO3/c16-12-5-2-1-4-11(12)10-15(9-7-14(18)19)8-3-6-13(15)17/h1-2,4-5,18H,3,6-10H2
charge 0 multiplicity 1
36 atoms
Cl -3.492276 0.736338 0.654092
O  -0.901314 0.967061 -1.956204
O  4.580544 -1.479156 0.58273
O  4.37577 -0.146452 -1.306311
C  0.413838 1.216174 0.143127
C  0.832411 2.565289 0.801349
C  -0.397551 3.506406 0.633198
C  1.591257 0.433867 -0.495444
C  -0.555182 1.677732 -0.983891
C  -0.383674 0.359701 1.211737
C  -0.967568 3.139016 -0.756609
C  2.692343 0.021112 0.506092
C  -1.148689 -0.842639 0.686715
C  -2.532493 -0.810237 0.38772
C  -0.500464 -2.094232 0.496414
C  3.930343 -0.506037 -0.195376
C  -3.24709 -1.920706 -0.097524
C  -1.186534 -3.227541 0.012846
C  -2.563673 -3.141191 -0.291724
H  1.700194 2.988326 0.256678
H  1.128066 2.449699 1.860173
H  -0.117955 4.57047 0.714236
H  -1.150343 3.302364 1.416527
H  1.193944 -0.453734 -1.020249
H  2.056032 1.06398 -1.277347
H  -1.080924 1.037797 1.73457
H  0.353613 0.022054 1.964661
H  -0.50546 3.747174 -1.560404
H  -2.060392 3.2518 -0.855562
H  3.014709 0.900844 1.100095
H  2.354695 -0.738728 1.230442
H  0.564159 -2.176144 0.744792
H  -4.314684 -1.832785 -0.31754
H  -0.650915 -4.17289 -0.123096
H  -3.107992 -4.012137 -0.671341
H  5.405154 -1.776994 0.10923
