program: Gaussian 09
title: 000200760
version: EM64L-G09RevD.01
frameworkgroup: C1[X(C12H23NO2)]
method: RPBEPBE
basis: SDD
operation: Freq
keyword: #p
keyword: freq=noraman
keyword: PBEPBE/SDD
title: #p freq=noraman PBEPBE/SDD
converged: YES YES NO NO
title: Mulliken charges:
elementType: O O N C C C C C C C C C C C C H H H H H H H H H H H H H H H H H H H H H H H
charge: -0.242982 -0.292242 -0.155857 -0.116225 -0.402355 -0.413792 0.196725 -0.371576 -0.363363 -0.361798 -0.350057 -0.304261 -0.291227 -0.696273 -0.700522 0.171633 0.229123 0.194316 0.225992 0.200897 0.269508 0.224507 0.230242 0.209826 0.186969 0.206950 0.177695 0.214446 0.223393 0.201744 0.196305 0.221355 0.215180 0.216366 0.209282 0.207164 0.214561 0.218350
chargesum: 0.00000
title: Mulliken charges with hydrogens summed into heavy atoms:
elementType: O O N C C C C C C C C C C C C
charge: -0.242982 -0.292242 -0.155857 0.055408 0.021083 0.013097 0.196725 0.122439 0.076705 0.032121 0.042084 0.120877 0.126434 -0.055445 -0.060447
polarizability: 1.65442662e+02 2.13727993e+00 1.33104364e+02 2.13355086e+00 1.95373270e-01 1.28752087e+02
1716.lowfreq: -7.0135 -4.6889 -0.0010 -0.0009 -0.0007 5.4644 15.4780 39.4316 54.0182
frequency: 13.9378 39.2533 53.9449 63.1999 68.1094 79.5319 85.5678 135.8542 160.0420 172.4331 226.9368 232.2145 233.9885 258.2635 285.5743 291.5413 304.4134 348.2148 397.5668 413.7267 446.9732 454.0170 525.4692 560.1807 617.2719 702.6998 721.2557 737.0541 765.7778 792.8800 830.5358 838.1745 868.2769 894.5756 900.2057 904.4954 930.4891 979.1337 1009.8500 1022.5905 1029.8243 1042.4319 1048.9401 1066.6791 1071.5861 1078.6066 1102.3053 1108.9680 1117.5600 1153.2555 1178.4190 1190.2820 1204.2161 1215.3270 1235.5982 1250.9397 1267.5323 1272.3366 1282.5471 1293.1851 1298.6193 1303.0466 1318.1313 1331.4326 1339.1894 1347.0781 1350.1731 1355.4141 1364.6553 1389.6842 1390.5690 1414.3942 1446.6755 1449.2895 1452.0306 1454.9132 1459.0693 1466.2985 1471.2212 1475.0891 1476.4395 1477.7445 1485.5747 1487.6889 1565.0346 2944.5298 2955.9794 2958.3406 2964.3699 2970.2674 2973.3515 2973.7193 2976.8146 2985.5545 2986.5455 3000.4629 3005.7918 3015.8686 3045.4331 3052.0032 3070.1329 3071.8186 3072.4534 3072.8117 3078.8633 3084.0355 3088.4418 3100.2044
redmass: 4.4201 3.1723 1.8872 2.9598 3.6591 3.0896 1.6370 4.0431 2.3531 3.1030 1.4838 1.1640 1.6093 2.7999 2.7728 3.2329 2.8805 4.2269 2.1027 3.3578 3.2651 2.9051 2.9219 3.3440 2.2297 2.6159 2.8756 1.1211 1.4815 4.1783 1.6873 1.4486 1.9510 1.9784 1.7843 1.5889 2.2891 2.3354 2.3715 2.2653 2.3951 1.6943 2.2513 2.3755 3.2864 2.3603 2.0570 2.2276 2.0256 2.1703 2.6845 1.1155 1.6791 1.4620 1.3779 1.4501 1.2375 1.2041 1.2781 1.1309 1.1317 1.3328 1.3360 1.3763 1.2243 1.5082 1.3943 1.4263 1.3148 1.2133 1.2126 2.5326 1.0826 1.0880 1.1007 1.1037 1.1021 1.0754 1.0698 1.0596 1.0425 1.0452 1.0692 1.0806 6.8937 1.0679 1.0604 1.0678 1.0602 1.0645 1.0362 1.0366 1.0676 1.0609 1.0636 1.0832 1.0964 1.0948 1.1009 1.1022 1.1000 1.1005 1.0999 1.0999 1.0964 1.0959 1.0992 1.0923
irintensity: 0.4727 0.0618 0.1085 1.4891 2.7268 0.2503 0.0232 1.5794 0.5322 1.7938 1.6585 0.0355 1.3953 4.6187 5.9718 7.3734 1.6797 11.0459 0.9451 2.4142 2.4497 0.2526 1.4838 24.2612 3.7891 4.3917 1.6240 8.9590 7.3526 17.0132 0.6220 0.1344 1.7824 8.5208 5.1314 3.2582 6.5540 5.9042 8.8999 44.9026 0.0900 4.7288 34.2483 1.6236 28.3857 3.9426 9.2837 15.4062 2.9935 9.6499 1.5926 0.9930 145.0652 1.5939 16.0333 36.6712 5.0335 8.4434 10.7040 1.1319 3.7700 0.8984 1.3097 6.4265 7.0599 4.6645 0.7862 2.4415 1.3077 8.9989 11.6767 95.8839 12.4536 10.3230 13.2112 10.1484 13.1390 1.4861 8.1061 4.1571 11.5611 11.9817 15.0862 12.9626 206.1760 49.8364 41.4413 47.0793 13.4683 49.0103 53.1523 22.6851 33.1602 66.4211 35.4801 28.6020 12.4163 6.4361 21.5151 21.5626 54.8431 86.8963 12.7422 96.6666 43.4476 15.5995 32.9989 23.1070
temp: 298.150 k
press: 1.00000 atm
elementType: 8 8 7 6 6 6 6 6 6 6 6 6 6 6 6 1 1 1 1 1 1 1 1 1 1 1 1 1 1 1 1 1 1 1 1 1 1 1
symmnumber: 1
zpe: 881612.0 jmol-1
zpe.correction: 0.335788 hartree
zpe.thermalcorrener: 0.353197 hartree
zpe.thermalcorrenthalpy: 0.354141 hartree
zpe.thermalcorrgfe: 0.288503 hartree
zpe.sumelectzpe: -675.041665 hartree
zpe.sumelectthermal: -675.024256 hartree
zpe.sumelectthermalent: -675.023312 hartree
zpe.sumelectthermalfe: -675.088950 hartree
dipole: 0.4402 0.0137 -2.8426
dipole: 2.8765
quadrupole: -98.8763 -92.1022 -97.0073
quadrupole: 0.3227 -5.2153 0.4440
quadrupole: -2.8810 3.8930 -1.0120 0.3227 -5.2153 0.4440
hfenergy: -675.3774531 hartree
pointgroup: C01 [X(C12H23N1O2)]
dipole: -0.1278986 -0.3999675 1.0509282 debye
polarizability: 163.9485921|6.6838849|133.9813239|3.1490741|1.9691682|129.3691969 unknown
InChI: InChI=1S/C12H23NO2/c1-3-5-11(6-4-2)12(14)13-7-9-15-10-8-13/h11H,3-10H2,1-2H3
charge 0 multiplicity 1
38 atoms
O  3.867597 0.480721 0.795289
O  -0.099472 0.310174 -2.017881
N  1.340744 -0.356187 -0.326988
C  -1.181336 -0.401666 0.041123
C  -2.002666 -1.530234 -0.654514
C  -1.992089 0.914549 0.203925
C  0.058045 -0.119261 -0.827101
C  2.511607 -0.111575 -1.205453
C  1.730328 -0.771216 1.036542
C  -3.202053 -2.047415 0.172465
C  -1.234786 2.021687 0.972592
C  3.449668 0.918784 -0.551966
C  2.688937 0.275087 1.649095
C  -3.912284 -3.234726 -0.513922
C  -2.079686 3.301213 1.149824
H  -0.90237 -0.761017 1.050099
H  -2.34709 -1.154424 -1.637062
H  -1.327735 -2.385403 -0.867402
H  -2.25604 1.281303 -0.807009
H  -2.938812 0.692584 0.733712
H  2.131415 0.248557 -2.175877
H  3.054394 -1.066001 -1.356484
H  2.253203 -1.748049 0.982777
H  0.847684 -0.888088 1.682777
H  -2.850796 -2.358358 1.178541
H  -3.933375 -1.231861 0.334254
H  -0.93055 1.638412 1.969723
H  -0.301207 2.271791 0.429679
H  4.384685 1.026563 -1.125412
H  2.939082 1.903383 -0.483687
H  2.149151 1.237611 1.790382
H  3.084399 -0.072971 2.617883
H  -4.770426 -3.592826 0.084032
H  -4.291792 -2.944448 -1.511515
H  -3.218498 -4.085008 -0.654925
H  -3.00601 3.091508 1.717549
H  -1.520342 4.08514 1.692988
H  -2.374918 3.715466 0.167744
