program: Gaussian 09
title: 000200707
version: EM64L-G09RevD.01
frameworkgroup: C1[X(C6H7NOS)]
method: RPBEPBE
basis: SDD
operation: Freq
keyword: #p
keyword: freq=noraman
keyword: PBEPBE/SDD
title: #p freq=noraman PBEPBE/SDD
converged: YES YES NO NO
title: Mulliken charges:
elementType: S O N C C C C C C H H H H H H H
charge: -0.038605 -0.355514 -0.009215 0.435032 -0.831507 -0.327524 -0.236342 -0.199813 -0.165054 0.265569 0.307082 0.242536 0.282499 0.248422 0.237998 0.144435
chargesum: 0.00000
title: Mulliken charges with hydrogens summed into heavy atoms:
elementType: S O N C C C C C C
charge: 0.105830 -0.355514 -0.009215 0.435032 -0.258856 -0.084988 0.046157 0.048609 0.072944
polarizability: 1.26994508e+02 -7.58366294e+00 9.75186906e+01 -3.83293306e+00 -2.26955676e+00 5.15664534e+01
1716.lowfreq: -8.1029 -5.8286 -0.0014 -0.0013 -0.0011 9.6245 94.0988 106.8070 191.7307
frequency: 94.0955 106.8035 191.7265 295.5977 309.6192 392.5489 441.6796 471.9235 526.7007 546.0848 592.0578 632.4028 705.6311 752.6714 762.0615 778.2621 846.8191 859.3728 930.4700 939.2397 971.6833 1038.7091 1095.1848 1153.7431 1168.3597 1220.6470 1227.0523 1246.1820 1273.8275 1314.6880 1408.2968 1433.1818 1484.5621 1540.7482 1616.9808 2368.1339 3053.2513 3138.2051 3155.1423 3165.1685 3183.9688 3212.3245
redmass: 6.1452 5.0677 5.6647 4.0449 2.8513 1.1417 3.6714 4.0166 4.0507 6.6019 5.1015 4.1465 1.6736 4.0302 1.5726 1.8296 3.1279 1.6339 1.6984 1.4182 1.3167 2.1438 1.8329 1.1272 1.0882 4.5505 2.5733 1.2319 3.0116 1.7521 1.6932 1.2636 3.0048 6.7281 6.1958 1.0370 1.0588 1.1058 1.0878 1.0917 1.0985 1.0972
irintensity: 6.4602 1.1259 7.3705 0.3476 6.9802 54.6173 12.0619 13.3990 0.9737 6.6149 5.1043 29.7900 11.1986 2.4925 70.9020 43.9679 4.7745 3.9201 34.8133 6.3055 0.0146 6.8795 11.2270 2.5309 0.8748 57.7894 10.7152 1.0920 1.6083 3.1029 41.9493 18.5949 19.5973 1.6822 2.2295 20.9261 12.0551 1.3300 0.8713 9.0969 7.7697 0.7759
temp: 298.150 k
press: 1.00000 atm
elementType: 16 8 7 6 6 6 6 6 6 1 1 1 1 1 1 1
symmnumber: 1
zpe: 308910.5 jmol-1
zpe.correction: 0.117658 hartree
zpe.thermalcorrener: 0.125737 hartree
zpe.thermalcorrenthalpy: 0.126681 hartree
zpe.thermalcorrgfe: 0.084487 hartree
zpe.sumelectzpe: -760.155588 hartree
zpe.sumelectthermal: -760.147509 hartree
zpe.sumelectthermalent: -760.146565 hartree
zpe.sumelectthermalfe: -760.188759 hartree
dipole: 4.1265 -2.1308 0.4068
dipole: 4.6620
quadrupole: -57.9853 -58.3509 -62.2744
quadrupole: 0.5490 -3.9279 -3.9630
quadrupole: 1.5516 1.1860 -2.7376 0.5490 -3.9279 -3.9630
hfenergy: -760.273246 hartree
pointgroup: C01 [X(C6H7N1O1S1)]
dipole: -1.5402044 0.8930529 0.4408793 debye
dipolederiv: -0.4764051 0.0617417 -0.0487918 0.001098 -0.0155007 -0.0090044 0.036757 0.0276173 -0.2093338 -0.6908466 0.2626977 0.0061952 0.3658514 -0.7758617 -0.0079771 0.0755112 0.0094349 -0.325128 0.2648898 -0.386316 -0.0038886 -0.6334341 0.5734491 0.0025378 -0.0484593 0.0391756 0.103227 0.4240191 -0.0172349 0.0148986 0.2624543 -0.2259707 -0.0363129 0.0460022 -0.0910326 -0.1036666 0.1535673 0.0612677 -0.0609245 0.0041329 0.0939307 0.118723 -0.0450563 0.0094373 0.2035043 -0.0588545 0.003315 0.0546985 -0.0220846 0.1270202 0.0431516 0.0208523 0.0409234 -0.0832914 -0.1471599 0.2022534 0.0355689 0.0223242 0.0854826 0.0316152 -0.0171251 0.0738785 -0.1125561 -0.093352 -0.0541521 0.0075861 -0.050927 -0.0334374 0.0141555 -0.0166934 0.0147433 -0.1523327 0.074493 -0.0232916 0.0519117 0.0275469 0.0410418 0.0342016 0.040691 0.0259377 -0.0911377 0.0601206 0.0109631 0.0343799 -0.0547789 -0.0331597 -0.0966402 0.0198451 -0.0549695 0.0674119 0.0349062 -0.0245177 0.0331182 0.043016 0.0414209 0.089618 0.038185 0.0231574 -0.0326527 0.070979 -0.0780202 -0.0380829 -0.056974 -0.0179064 -0.041909 -0.0161555 -0.0486775 0.1322806 0.0808354 0.0178725 -0.0155434 -0.019681 0.0320049 -0.0352458 -0.0207997 -0.0296112 0.172615 0.0201074 0.0833369 -0.0097818 0.0886173 -0.0066311 -0.0210765 -0.0096293 -0.0203626 0.167695 -0.0619061 -0.0308801 -0.049135 -0.0282155 0.104543 -0.0170765 -0.0482886 -0.0171793 0.149533 0.3446063 -0.0890352 -0.0122092 0.051054 0.0095744 -0.0687603 -0.0556368 -0.0024726 0.1138322 unknown
polarizability: 125.8978955|-8.9602064|96.5667415|-3.6414102|10.3496824|53.6150154 unknown
InChI: InChI=1S/C6H7NOS/c8-7-4-2-1-3-6(7)5-9/h1-4,9H,5H2
charge 0 multiplicity 1
16 atoms
S  2.98948 0.201014 -0.925364
O  0.769156 -1.92871 -0.096235
N  -0.055454 -0.869378 -0.03972
C  0.449104 0.392952 0.32186
C  1.90966 0.446457 0.634197
C  -0.429523 1.492127 0.358868
C  -1.401471 -1.021161 -0.348466
C  -1.799706 1.350904 0.049506
C  -2.278736 0.066993 -0.306792
H  2.192798 1.428421 1.038582
H  2.192589 -0.354653 1.334784
H  -0.016007 2.466298 0.636563
H  -1.687412 -2.038516 -0.618526
H  -2.472857 2.211465 0.084778
H  -3.330185 -0.099474 -0.55762
H  2.523666 -1.101341 -1.090514
