program: Gaussian 09
title: 000200725
version: EM64L-G09RevD.01
frameworkgroup: C1[X(C8H17ClNO3P)]
method: RPBEPBE
basis: SDD
operation: Freq
keyword: #p
keyword: freq=noraman
keyword: PBEPBE/SDD
title: #p freq=noraman PBEPBE/SDD
converged: YES YES NO NO
title: Mulliken charges:
elementType: Cl P O O O N C C C C C C C C H H H H H H H H H H H H H H H H H
charge: -0.039998 1.364166 -0.461505 -0.523649 -0.597292 -0.557148 -0.276820 -0.316542 -0.670804 -0.652152 -0.252185 -0.644510 0.103359 -0.445399 0.236374 0.230858 0.247935 0.224713 0.224876 0.217164 0.225589 0.213177 0.246381 0.221915 0.212629 0.234724 0.211434 0.242620 0.227238 0.282047 0.270804
chargesum: 0.00000
title: Mulliken charges with hydrogens summed into heavy atoms:
elementType: Cl P O O O N C C C C C C C C
charge: -0.039998 1.364166 -0.461505 -0.523649 -0.597292 -0.557148 0.190412 0.156106 -0.003175 0.029321 0.195168 0.036782 0.385406 -0.174595
polarizability: 1.78855905e+02 -5.79286587e-02 1.26874958e+02 -2.20903187e+00 7.44110855e+00 1.16724866e+02
1716.lowfreq: -17.5303 -6.8385 -0.0029 -0.0020 -0.0020 6.2115 8.8943 18.9199 25.4889
frequency: -11.1880 18.7588 24.8111 37.0711 55.6260 64.0760 69.9304 85.0194 119.7364 148.8584 166.2575 188.8121 220.8457 225.2646 232.6120 247.0196 256.2586 271.1579 294.2229 310.4067 348.9132 355.6491 396.6355 432.0893 458.3341 476.9910 576.4937 653.8315 673.3104 761.3857 767.5530 782.6812 797.1698 813.6517 867.7564 911.4105 922.0859 924.1669 1013.1112 1023.3342 1055.7371 1066.0791 1070.6522 1078.4519 1089.8769 1110.5481 1139.0545 1173.0211 1196.0163 1201.8693 1261.2739 1285.2251 1291.3171 1330.3174 1343.6249 1354.0243 1368.5998 1386.1408 1388.1129 1390.1190 1457.5992 1461.8889 1463.1364 1466.8771 1473.9771 1478.3307 1481.8425 1488.1566 1495.4886 1642.0078 2977.0747 2985.0144 2987.2657 2987.4748 2992.4228 3004.3335 3058.6386 3068.5151 3069.7182 3081.5403 3083.0914 3085.9348 3093.4473 3099.5956 3106.5158 3137.4080 3216.5575
redmass: 4.5691 3.3773 2.7353 2.7974 4.2906 4.0121 2.4234 2.5203 2.3721 4.2812 1.7106 4.3581 1.1677 1.6356 3.5717 3.9946 5.1624 1.6837 3.6546 2.7059 4.3768 4.6790 4.5838 5.3763 3.5455 4.3832 4.8020 11.6946 4.6306 1.7207 1.1416 1.2165 1.1139 5.5121 3.2908 2.3514 1.5538 1.4065 2.9603 2.6131 10.6346 4.5792 3.4451 1.9590 2.1406 1.6373 1.5440 3.5023 1.9645 1.1929 1.1236 1.1289 1.1511 1.2232 1.2213 1.2238 1.3064 1.2199 1.2184 1.2234 1.0423 1.0540 1.0612 1.0534 1.0461 1.0521 1.0566 1.0618 1.0714 6.3440 1.0676 1.0361 1.0370 1.0414 1.0578 1.0619 1.1016 1.0952 1.1001 1.0988 1.0990 1.0977 1.0990 1.1019 1.1020 1.0946 1.0963
irintensity: 0.3458 0.4447 1.0130 0.5402 1.0657 1.2448 0.6202 0.5209 0.3166 1.3412 3.1282 0.6233 2.0944 1.4544 5.6828 2.2690 4.9712 1.7657 26.0100 4.1992 3.9525 7.8523 1.9961 57.7953 16.6178 18.5487 29.2254 142.0470 108.0224 30.9047 7.0138 47.3986 2.5101 126.7256 85.5193 78.4209 17.0184 104.3307 117.9051 158.3191 117.6325 203.8570 190.5544 2.1769 2.3374 11.1898 5.1217 86.6366 43.8307 0.1645 1.4409 7.8808 4.5969 2.0070 9.6935 3.7253 14.6579 30.7817 18.0905 22.9652 14.8157 4.0804 7.1383 5.2915 5.6338 13.4997 11.3927 24.1417 4.4259 36.5888 28.0046 23.2063 32.4443 18.6604 27.3409 40.0919 2.6039 0.8462 2.9071 37.6832 37.2502 39.4692 37.8435 37.7522 29.6986 21.6183 14.4159
temp: 298.150 k
press: 1.00000 atm
elementType: 17 15 8 8 8 7 6 6 6 6 6 6 6 6 1 1 1 1 1 1 1 1 1 1 1 1 1 1 1 1 1
symmnumber: 1
zpe: 649077.1 jmol-1
zpe.correction: 0.247220 hartree
zpe.thermalcorrener: 0.265572 hartree
zpe.thermalcorrenthalpy: 0.266516 hartree
zpe.thermalcorrgfe: 0.197887 hartree
zpe.sumelectzpe: -1395.559647 hartree
zpe.sumelectthermal: -1395.541295 hartree
zpe.sumelectthermalent: -1395.540351 hartree
zpe.sumelectthermalfe: -1395.608981 hartree
dipole: 4.6064 2.7819 3.7619
dipole: 6.5658
quadrupole: -99.9909 -95.3828 -105.9744
quadrupole: -2.2076 1.9434 -1.7218
quadrupole: 0.4585 5.0666 -5.5250 -2.2076 1.9434 -1.7218
hfenergy: -1395.8068671 hartree
pointgroup: C01 [X(C8H17Cl1N1O3P1)]
dipole: 1.4064577 0.4774321 -2.1134774 debye
polarizability: 177.1282199|-2.7106035|113.3772395|-8.7671956|3.4489153|131.9502686 unknown
InChI: InChI=1S/C8H17ClNO3P/c1-4-10(5-2)14(11,12-6-3)13-8-7-9/h7-8H,4-6H2,1-3H3
charge 0 multiplicity 1
31 atoms
Cl -4.792796 0.632221 1.662732
P  0.436529 -0.810157 0.927931
O  0.083124 -2.316364 0.146201
O  -0.930893 0.220553 0.447191
O  0.577394 -1.043241 2.490573
N  1.724352 0.005153 0.119308
C  1.495566 0.966287 -0.994747
C  3.029582 0.046187 0.843054
C  2.515886 0.806468 -2.138244
C  3.278593 1.366168 1.600949
C  0.271452 -2.516781 -1.315661
C  -0.970806 -2.110964 -2.115462
C  -2.117795 0.143979 1.206064
C  -3.263786 0.636737 0.688737
H  0.473615 0.811746 -1.377729
H  1.525827 2.004634 -0.606057
H  3.046569 -0.793203 1.560991
H  3.834491 -0.139572 0.107877
H  3.544501 1.040488 -1.812055
H  2.507487 -0.222299 -2.541012
H  2.261854 1.502077 -2.9589
H  3.28867 2.237695 0.921959
H  2.500894 1.524138 2.367993
H  4.260474 1.325858 2.107516
H  1.177068 -1.970658 -1.646636
H  0.463044 -3.600083 -1.39649
H  -0.835449 -2.382046 -3.179713
H  -1.862282 -2.63725 -1.734465
H  -1.159547 -1.025074 -2.052656
H  -2.037456 -0.294045 2.209019
H  -3.37146 1.079348 -0.301365
