program: Gaussian 09
title: 000200704
version: EM64L-G09RevD.01
frameworkgroup: C1[X(C10H12N2S)]
method: RPBEPBE
basis: SDD
operation: Freq
keyword: #p
keyword: freq=noraman
keyword: PBEPBE/SDD
title: #p freq=noraman PBEPBE/SDD
converged: YES YES NO NO
title: Mulliken charges:
elementType: S N N C C C C C C C C C C H H H H H H H H H H H H
charge: 0.127128 -0.601565 -0.348078 0.489062 -0.326593 -0.389347 -0.397306 -0.073153 -0.774647 -0.232738 -0.234970 -0.244468 -0.060839 0.219459 0.224125 0.226454 0.239596 0.341188 0.258207 0.223692 0.225036 0.227866 0.318992 0.329723 0.233175
chargesum: 0.00000
title: Mulliken charges with hydrogens summed into heavy atoms:
elementType: S N N C C C C C C C C C C
charge: 0.127128 0.047150 -0.114903 0.489062 -0.107134 -0.165222 -0.170853 0.166443 -0.175252 -0.009045 -0.009934 -0.016602 -0.060839
polarizability: 2.61589649e+02 -1.20724095e+01 1.20556940e+02 -6.33765467e+00 3.13361631e+00 9.00941061e+01
1716.lowfreq: -9.7828 -2.7123 -0.0021 0.0011 0.0021 10.4631 21.0461 28.1871 39.3120
frequency: 21.0024 28.0864 39.1258 69.4197 98.6622 133.1557 195.8904 257.4571 279.0956 338.5011 354.8702 396.5100 403.9046 408.4242 435.5900 464.7212 507.8843 556.3817 579.8141 592.2098 615.8657 642.2838 697.2000 714.2775 765.1396 811.5947 846.0264 868.8846 920.4150 928.0496 973.4366 976.3906 980.7853 988.2863 996.7390 1026.3804 1044.8901 1076.4164 1096.9051 1170.9735 1176.6988 1191.7616 1226.5121 1250.5195 1283.2101 1300.9517 1309.6755 1339.2158 1385.7670 1439.4485 1451.5283 1485.1121 1583.6570 1611.4746 1615.2360 1648.4762 1656.1915 2937.4403 3077.5333 3089.4062 3115.9745 3117.3366 3124.8126 3137.5545 3148.1517 3164.0503 3392.0933 3526.1869 3674.4377
redmass: 5.3496 3.9334 5.0476 6.1719 3.6854 3.9178 3.6830 2.7017 4.2917 1.2452 2.2278 3.4379 2.7836 1.3006 3.5771 7.0526 3.1431 2.9303 2.7478 4.8911 6.4354 5.4342 1.7017 1.4573 1.7408 2.8305 1.3175 1.8237 1.5733 1.8700 1.5612 1.4187 1.2025 6.0377 1.2889 2.1704 1.6337 2.0433 2.0198 1.0751 1.1347 1.1171 2.1006 1.2230 2.4987 1.3231 1.6168 1.2823 6.0175 2.1347 1.1555 2.3098 5.7561 5.5990 1.2700 4.2128 5.8257 1.0688 1.0901 1.0956 1.0877 1.0890 1.0861 1.0914 1.0958 1.1015 1.0776 1.0448 1.1043
irintensity: 3.9549 1.4403 5.3998 8.1608 1.4204 0.5943 9.6086 3.9774 3.0211 7.6600 20.9644 9.3861 0.0163 294.8765 6.4406 3.4284 15.9629 25.0961 117.3837 9.9192 0.0733 19.2589 43.5253 95.7587 64.8987 4.3079 0.1136 0.6098 2.3866 13.6861 92.4443 24.6355 88.0571 0.2495 14.7666 4.7541 4.5457 8.3361 8.7637 0.7548 1.4523 0.4553 1.3699 40.3405 227.5097 1.9885 3.0703 0.5401 1.5132 11.8615 19.0465 19.3353 1.7510 21.4014 124.3831 256.3754 0.5807 95.9849 17.1919 16.4692 0.6265 39.2011 1.0396 12.9923 44.9637 28.2315 18.6594 34.0990 22.0360
temp: 298.150 k
press: 1.00000 atm
elementType: 16 7 7 6 6 6 6 6 6 6 6 6 6 1 1 1 1 1 1 1 1 1 1 1 1
symmnumber: 1
zpe: 518952.4 jmol-1
zpe.correction: 0.197659 hartree
zpe.thermalcorrener: 0.211121 hartree
zpe.thermalcorrenthalpy: 0.212065 hartree
zpe.thermalcorrgfe: 0.154860 hartree
zpe.sumelectzpe: -894.855249 hartree
zpe.sumelectthermal: -894.841787 hartree
zpe.sumelectthermalent: -894.840843 hartree
zpe.sumelectthermalfe: -894.898048 hartree
dipole: -2.4320 1.2626 -0.8914
dipole: 2.8815
quadrupole: -54.0871 -77.0816 -89.4786
quadrupole: -10.2433 3.7586 -0.9040
quadrupole: 19.4620 -3.5325 -15.9295 -10.2433 3.7586 -0.9040
hfenergy: -895.0529077 hartree
pointgroup: C01 [X(C10H12N2S1)]
dipole: 0.9509695 0.6073982 0.109328 debye
dipolederiv: -1.0003931 -0.1107259 0.0919397 -0.289373 -0.2071947 0.0287696 -0.0618617 0.0636616 -0.2552544 -1.1576453 -0.2306305 -0.393178 -0.3440978 -0.8416586 -0.1762356 -0.2123161 -0.0858331 -0.4836402 -0.4824874 0.0425882 -0.0982989 0.1193072 -0.4782472 -0.2688174 0.3682769 -0.1369083 -1.2589084 0.3649148 -0.0499285 0.0080294 -0.0821264 -0.0305931 0.048468 0.0496557 0.0581674 0.0428818 -0.0187966 -0.0457727 -0.0333885 -0.1880105 0.142441 -0.1165367 0.008543 -0.1444143 -0.0963776 -0.1141123 0.0601318 -0.0469981 0.1304342 -0.0694393 -0.0543991 -0.0714591 -0.048789 -0.1209086 -0.2294403 -0.0184118 0.0000576 0.0157647 0.0488466 -0.109692 0.0000087 -0.1164576 -0.1301905 0.0338093 0.0204492 -0.0284936 -0.014008 -0.042915 -0.1362328 0.0428609 -0.1308021 -0.1499983 0.53193 0.0853409 0.1603494 0.0949835 0.2146989 0.0199206 0.6380148 0.0406258 0.0124089 -0.077875 -0.0139965 -0.0035475 -0.0938271 0.0923302 -0.1155282 0.0358537 -0.1188919 -0.0899731 0.1389791 0.0604913 -0.059666 0.1008966 -0.0247405 -0.0714968 -0.0921284 -0.0689471 -0.1061319 -0.0463108 -0.0533819 -0.0006807 0.0204485 -0.0820607 -0.0432517 -0.0243939 -0.04163 -0.1552652 1.3807408 0.5640078 0.0011568 0.6600656 0.4542826 0.3489067 -0.6109964 0.1977074 1.3475228 0.0452865 0.006548 0.0120695 0.0655229 -0.0765913 0.1018197 -0.0329298 0.1078186 0.0910142 -0.0220901 -0.0876909 0.0675334 -0.0688394 0.0523184 0.050801 0.0578535 0.0543795 0.1078179 0.0902511 0.0580882 -0.0185414 0.0274247 -0.066456 0.1058974 -0.0035471 0.1030187 0.1023786 0.0782933 0.0181352 0.0027827 0.0761982 -0.0498558 0.0982328 0.011577 0.0923475 0.1006302 0.1847699 0.0590262 -0.0342404 0.0902651 0.1113823 -0.0148095 -0.2452825 -0.0543014 0.0575351 0.0029819 -0.0932019 -0.0125867 0.0037949 -0.096545 0.03612 -0.080999 0.0595391 0.0718208 0.0668785 0.0259876 -0.0039188 0.0633945 -0.0764402 0.1120423 -0.021366 0.1133768 0.0997002 -0.0793101 -0.0814535 0.0647394 -0.1002924 0.043835 0.0676669 0.0778044 0.066839 0.1166449 -0.1139103 0.0805479 -0.0096889 0.0896273 0.0709607 0.0369968 -0.0109609 0.0370286 0.1469655 0.1931055 -0.0949469 0.0586575 -0.1140435 0.3275929 -0.0314463 0.0640484 -0.0353356 0.1481396 0.3157923 -0.071234 0.0631071 -0.0328454 0.3521257 -0.0308051 0.0534875 -0.0450497 0.1521814 -0.0853616 -0.1299675 0.2128052 -0.2306642 0.2319229 0.1136094 0.0602564 0.0328501 0.2490063 unknown
polarizability: 262.0884372|8.8478786|111.3499444|-5.6945287|-14.1252244|98.8023143 unknown
InChI: InChI=1S/C10H12N2S/c11-10(12)13-8-4-7-9-5-2-1-3-6-9/h1-7,11H,8,12H2
charge 0 multiplicity 1
25 atoms
S  3.102345 -0.214025 1.213381
N  5.428532 1.017999 0.666984
N  4.376185 -0.098179 -1.223936
C  -1.890114 -0.37249 0.079589
C  -0.554579 -0.981855 0.230387
C  -2.105939 0.898171 -0.529968
C  -3.026052 -1.080582 0.566484
C  0.643836 -0.455803 -0.161301
C  1.953871 -1.156666 0.004601
C  -3.403851 1.434199 -0.642582
C  -4.326523 -0.544719 0.454292
C  -4.522893 0.717321 -0.151586
C  4.448721 0.270948 0.022891
H  -0.542228 -1.971672 0.713046
H  -1.254767 1.468972 -0.91732
H  -2.880651 -2.060616 1.03848
H  0.696215 0.53282 -0.636747
H  2.566656 -1.155305 -0.92159
H  1.849177 -2.17779 0.403692
H  -3.548126 2.412845 -1.114653
H  -5.184191 -1.108961 0.837632
H  -5.530784 1.137387 -0.241804
H  6.240628 1.353376 0.152867
H  5.352231 1.243461 1.657517
H  5.152302 0.196862 -1.841957
