program: Gaussian 09
title: 000200790
version: EM64L-G09RevD.01
frameworkgroup: C1[X(C20H26N2O3)]
method: RPBEPBE
basis: SDD
operation: Freq
keyword: #p
keyword: freq=noraman
keyword: PBEPBE/SDD
title: #p freq=noraman PBEPBE/SDD
converged: YES YES NO NO
title: Mulliken charges:
elementType: O O O N N C C C C C C C C C C C C C C C C C C C C H H H H H H H H H H H H H H H H H H H H H H H H H H
charge: -0.456224 -0.306502 -0.270606 -0.105045 -0.175424 -0.362061 -0.374228 -0.384503 -0.408361 -0.373075 -0.117754 0.469816 -0.310101 -0.388743 -0.351261 -0.358572 -0.375645 0.318438 0.384484 -0.347773 -0.388100 -0.221097 -0.196254 -0.537393 -0.256108 0.191750 0.209142 0.195579 0.207980 0.209123 0.206174 0.220267 0.202300 0.213681 0.223075 0.210313 0.212952 0.240292 0.217653 0.239843 0.359453 0.235151 0.244260 0.250183 0.247103 0.224264 0.227938 0.241839 0.216060 0.217128 0.228589
chargesum: 0.00000
title: Mulliken charges with hydrogens summed into heavy atoms:
elementType: O O O N N C C C C C C C C C C C C C C C C C C C C
charge: -0.096772 -0.306502 -0.270606 -0.105045 -0.175424 0.038831 0.029332 0.030794 0.014206 0.063682 0.092559 0.469816 0.143143 -0.171090 -0.111418 -0.123421 -0.131385 0.318438 0.384484 -0.097591 -0.140997 0.003168 0.031684 0.137634 -0.027520
polarizability: 3.34951060e+02 9.47938783e+00 2.11585673e+02 -2.11409762e+01 9.74198386e-01 1.95144635e+02
1716.lowfreq: -0.0009 -0.0006 0.0005 3.3026 5.3195 9.8103 15.0889 17.8413 26.5167
frequency: 13.3983 17.6686 26.3760 34.9461 51.9365 55.9144 64.1126 84.4479 97.2163 114.3239 139.6897 149.6617 177.6377 207.0467 222.1436 231.7136 234.1122 245.1073 258.1304 276.6921 321.1125 348.9041 364.5004 386.0378 402.8252 411.3980 414.5822 423.8217 434.0308 457.3412 475.3824 477.9534 501.2321 502.4987 528.8639 536.1331 593.2916 604.6541 611.9219 634.9155 678.2736 691.3715 716.7610 757.3852 772.4726 780.9321 792.7693 797.8448 814.7414 822.8714 845.4967 856.5757 889.0158 906.2249 914.1840 921.7803 938.6869 953.1886 961.2732 975.9007 982.3584 986.0261 986.7061 998.4460 1005.2959 1024.1548 1041.3232 1050.3463 1061.3351 1072.3452 1085.1630 1087.0738 1110.3298 1112.8342 1121.2306 1143.5515 1146.4024 1158.7500 1167.5959 1168.3484 1181.9980 1185.2816 1199.0581 1209.0353 1217.6388 1229.0914 1235.5153 1240.5950 1254.8671 1283.9480 1299.0670 1311.2644 1313.2802 1316.8153 1326.3009 1342.3769 1349.1761 1352.4972 1364.6761 1373.0166 1380.0971 1387.1674 1394.1460 1403.8059 1427.9355 1438.1208 1444.7225 1452.5379 1456.6420 1459.9082 1462.1587 1464.5688 1467.6288 1474.8531 1475.4572 1481.8953 1508.9746 1576.1300 1594.1785 1612.3558 1632.7666 2864.2352 2871.0453 2893.0662 2905.3291 2908.8949 2949.8897 2960.7028 2972.7793 3032.9820 3033.6345 3038.3126 3042.6142 3049.9710 3055.2082 3082.8664 3118.5593 3129.2779 3136.3833 3137.8085 3148.8342 3155.9218 3161.7160 3164.7231 3171.0290 3173.6172 3546.6536
redmass: 5.5916 3.4111 3.6258 5.0917 4.0818 3.5882 5.0817 4.1473 4.4135 3.7743 3.9467 3.8715 3.5775 5.0022 2.6924 2.7332 2.1866 2.3917 2.3175 2.4018 2.3350 4.5794 3.2080 3.8000 2.8814 2.9421 3.0814 2.7842 1.2317 3.3307 2.6098 3.1761 3.2632 2.9532 2.4940 4.8788 5.1627 2.8343 6.2914 6.5763 3.0065 2.0996 3.6625 1.6275 4.2658 3.4349 5.4096 1.4537 1.6589 1.2635 1.5942 2.3369 1.4606 1.9051 1.6619 2.6447 1.3643 2.0818 1.3724 5.5623 1.3021 6.0468 5.2076 3.0088 2.8006 2.0562 2.0999 1.8086 2.1654 2.0673 1.5686 2.1934 2.4067 1.2598 1.4253 2.2334 2.3646 1.3717 1.1394 1.7026 1.1654 1.3091 1.2033 1.4714 3.2038 2.0444 1.7490 1.4522 1.2587 1.3438 1.3930 1.3025 1.3191 1.3247 1.3053 1.3788 1.4820 1.8931 1.5507 2.2630 1.9284 3.1611 1.8500 1.7156 3.0203 1.2453 2.3042 1.0859 1.0858 1.1611 1.0990 1.0506 1.1044 1.0740 1.0969 2.0433 2.4223 7.0137 6.4318 6.2826 6.4341 1.0710 1.0696 1.0694 1.0705 1.0689 1.0334 1.0799 1.0607 1.0908 1.1035 1.0908 1.0907 1.0890 1.1050 1.0890 1.0985 1.0848 1.0869 1.0890 1.0871 1.0927 1.0946 1.0954 1.0960 1.1003 1.0654
irintensity: 0.2244 0.6883 0.3506 0.0713 1.6488 1.4789 0.2908 3.2942 2.4566 4.9661 2.2039 3.8324 2.5514 6.4258 2.4328 1.7106 0.5550 1.8770 1.1462 13.1601 2.7782 9.1781 5.2729 1.7387 2.8507 0.0953 4.8694 26.6947 137.8156 12.9431 4.3583 8.4627 6.1957 10.2796 23.0739 1.5735 7.0064 8.0424 0.2108 0.3140 28.2144 31.3328 1.6062 90.7511 16.8091 18.2456 15.4744 6.6175 78.6934 0.9706 5.7529 4.5561 5.3416 17.6307 13.6387 22.3937 1.1642 7.0691 0.3534 82.5599 1.2753 34.4110 25.3100 127.0966 12.5042 25.9644 50.2786 3.1422 4.6776 3.7169 7.8536 5.6906 24.3027 0.2062 11.1332 29.7434 54.2945 1.7791 14.4232 11.0553 44.8992 69.3740 13.5731 23.9105 239.3079 322.0679 15.0023 27.1547 13.4006 31.1134 22.3694 13.8122 4.3575 1.7937 9.4439 9.3209 0.1559 4.3481 6.6114 11.4817 33.5836 6.0455 8.5289 9.3531 5.7222 16.8878 2.4438 5.8105 1.9807 62.1835 59.0923 12.4661 35.2873 66.1227 11.8198 79.4697 341.0503 0.3827 23.1487 85.1178 5.9011 55.0935 63.8316 71.7748 57.6316 177.1304 82.9992 29.6002 31.7415 5.9218 56.5436 62.1668 48.7101 27.2659 39.8031 22.6691 32.3469 2.6082 19.8724 11.0065 14.1164 29.4904 22.2131 25.9904 5.5560 4.6840 12.9047
temp: 298.150 k
press: 1.00000 atm
elementType: 8 8 8 7 7 6 6 6 6 6 6 6 6 6 6 6 6 6 6 6 6 6 6 6 6 1 1 1 1 1 1 1 1 1 1 1 1 1 1 1 1 1 1 1 1 1 1 1 1 1 1
symmnumber: 1
zpe: 1116825.5 jmol-1
zpe.correction: 0.425376 hartree
zpe.thermalcorrener: 0.449327 hartree
zpe.thermalcorrenthalpy: 0.450271 hartree
zpe.thermalcorrgfe: 0.368444 hartree
zpe.sumelectzpe: -1110.965387 hartree
zpe.sumelectthermal: -1110.941436 hartree
zpe.sumelectthermalent: -1110.940492 hartree
zpe.sumelectthermalfe: -1111.022319 hartree
dipole: -0.6197 -0.5179 1.9336
dipole: 2.0955
quadrupole: -141.6293 -157.3495 -140.4333
quadrupole: -10.9659 -15.0306 -1.9792
quadrupole: 4.8414 -10.8788 6.0374 -10.9659 -15.0306 -1.9792
hfenergy: -1111.3907631 hartree
pointgroup: C01 [X(C20H26N2O3)]
dipole: 0.2554354 0.0059367 0.7838448 debye
polarizability: 335.7127507|0.7408571|210.9438279|20.8572436|2.3948486|195.024789 unknown
InChI: InChI=1S/C20H26N2O3/c1-24-19-9-7-17(8-10-19)22-13-11-21(12-14-22)15-18(23)16-25-20-5-3-2-4-6-20/h2-10,18,23H,11-16H2,1H3
charge 0 multiplicity 1
51 atoms
O  -3.882691 -2.926222 -0.997239
O  -4.481164 -0.198525 -0.576965
O  7.514106 1.511251 -0.233832
N  -0.423333 -1.756885 -0.179271
N  2.335505 -0.870544 -0.237619
C  0.545031 -2.217208 0.846582
C  0.286996 -1.539131 -1.464118
C  1.643885 -1.160495 1.040987
C  1.399351 -0.486514 -1.310594
C  -1.602154 -2.647349 -0.310195
C  -2.834166 -1.90604 -0.860754
C  3.623601 -0.260165 -0.198945
C  -3.28994 -0.783313 0.07297
C  4.617356 -0.713751 0.713992
C  3.989289 0.79201 -1.093197
C  5.910882 -0.151383 0.742587
C  5.283073 1.344825 -1.080927
C  6.253672 0.88236 -0.163075
C  -5.139603 0.859154 0.07655
C  -4.724906 1.405144 1.316315
C  -6.279036 1.374237 -0.589892
C  -5.46363 2.470954 1.881787
C  -7.003304 2.435922 -0.012754
C  8.544869 1.040727 0.689449
C  -6.601215 2.991593 1.227318
H  1.019592 -3.189193 0.559493
H  0.009755 -2.362786 1.803088
H  0.741296 -2.49288 -1.834127
H  -0.430979 -1.187493 -2.226589
H  1.175594 -0.233207 1.44752
H  2.369237 -1.525565 1.784837
H  1.9516 -0.427091 -2.264997
H  0.933938 0.509541 -1.115696
H  -1.861704 -3.045253 0.688931
H  -1.409401 -3.526982 -0.96887
H  -2.613804 -1.459997 -1.854388
H  -3.571854 -1.195015 1.06362
H  -2.490737 -0.027504 0.187749
H  4.396024 -1.539759 1.397863
H  3.259119 1.201618 -1.796779
H  -4.726335 -2.451749 -1.216634
H  6.639879 -0.539242 1.460925
H  5.554775 2.150348 -1.770496
H  -3.844852 1.019164 1.838761
H  -6.574095 0.934883 -1.548035
H  -5.141872 2.893363 2.840466
H  -7.883511 2.831171 -0.53199
H  9.433151 1.650836 0.467386
H  8.245091 1.19252 1.7458
H  8.778815 -0.030089 0.52484
H  -7.166396 3.816908 1.672562
