program: Gaussian 09
title: 000200693
version: EM64L-G09RevD.01
frameworkgroup: C1[X(C14H23N2O)]
method: RPBEPBE
basis: SDD
operation: Freq
keyword: #p
keyword: freq=noraman
keyword: PBEPBE/SDD
title: #p freq=noraman PBEPBE/SDD
converged: YES YES NO NO
title: Mulliken charges:
elementType: O N N C C C C C C C C C C C C C C H H H H H H H H H H H H H H H H H H H H H H H
charge: -0.237909 -0.041711 -0.618351 -0.389301 -0.371661 -0.373996 -0.368188 -0.354623 -0.419816 -0.355729 -0.689171 -0.233924 -0.133059 0.249660 -0.181140 -0.223726 0.208788 0.204737 0.206033 0.212283 0.211971 0.197521 0.197642 0.227415 0.235043 0.192336 0.192716 0.251601 0.264853 0.197611 0.197787 0.225536 0.211470 0.211055 0.341591 0.295476 0.281215 0.264201 0.378307 0.335455
chargesum: 1.00000
title: Mulliken charges with hydrogens summed into heavy atoms:
elementType: O N N C C C C C C C C C C C C C C
charge: -0.237909 -0.041711 0.095410 0.021470 0.052593 0.021168 0.094271 0.030429 0.096637 0.039669 -0.041110 0.107667 0.162417 0.249660 0.100075 0.040475 0.208788
polarizability: 2.48200553e+02 5.79231684e+00 1.62631468e+02 -1.98250511e+01 1.00784484e+01 1.17638438e+02
1716.lowfreq: -10.4623 -4.3179 -1.1846 -0.0010 -0.0003 0.0004 12.9817 24.2027 35.0812
frequency: 11.7883 24.1955 34.9953 40.7989 42.9500 85.4899 93.1796 96.0828 141.6402 144.6177 150.8672 165.3895 183.1195 197.0775 229.4576 285.5516 325.7149 347.8660 385.7958 406.1947 421.6317 448.9480 476.3586 488.8981 525.3250 590.7743 599.6610 658.0358 690.6180 720.5375 724.6281 730.8412 733.3851 754.0024 793.9342 825.5613 858.9033 877.2164 892.7626 937.6112 941.8747 963.7152 989.0182 1001.0459 1008.8006 1012.4529 1017.2441 1044.6572 1053.2585 1055.3120 1071.6039 1079.4847 1091.5358 1118.1735 1121.2800 1152.5356 1171.2234 1188.0753 1205.8315 1222.8126 1225.2911 1259.7892 1265.5872 1280.6299 1285.7686 1297.6437 1299.3747 1304.6895 1314.2173 1334.9186 1343.0239 1353.4378 1355.5003 1363.4481 1375.8509 1393.8940 1437.1009 1461.8487 1462.8126 1465.9600 1469.5596 1474.5885 1478.4976 1478.9541 1483.9253 1489.1162 1495.5409 1571.5090 1585.7647 1624.4110 1658.0981 2955.5163 2958.2859 2962.9670 2968.8991 2972.7059 2976.7766 2982.9924 2991.7025 3001.4999 3013.1548 3027.3445 3032.8799 3040.2729 3052.1292 3072.3605 3078.6119 3102.9959 3166.3482 3174.6011 3189.7643 3207.0189 3517.5850 3663.2358
redmass: 4.9452 4.7562 3.0577 1.9017 3.2472 3.7917 1.7631 2.3865 2.0688 2.0546 3.8277 3.7283 3.7402 4.3246 1.1293 3.1927 3.4443 3.3663 4.4865 2.6441 3.0675 2.3195 1.9897 3.4468 2.3958 4.2833 4.1007 1.4706 2.2535 4.6330 1.0647 3.1959 1.0872 1.1069 1.1779 1.6047 1.3177 3.6155 1.9483 1.3538 1.3108 1.4634 3.9939 1.3915 3.3871 1.2867 4.5924 3.2530 2.8781 1.8981 2.5496 2.3542 1.8490 2.5443 1.9412 1.6701 3.2086 1.6503 1.1408 1.2789 1.3963 1.2889 1.2807 1.1036 1.0794 1.1121 1.1055 1.2936 1.3317 1.3024 1.4065 1.5049 1.5992 3.5801 5.2153 1.2128 1.8967 1.0873 1.0743 1.0902 1.1366 1.3187 1.3293 1.0734 1.1668 1.1045 1.2020 4.2066 3.1629 3.0409 2.2384 1.0588 1.0589 1.0591 1.0594 1.0590 1.0362 1.0586 1.0975 1.0997 1.1023 1.1042 1.0592 1.1049 1.1051 1.1008 1.0992 1.1080 1.0921 1.0954 1.0928 1.1013 1.0471 1.1032
irintensity: 1.5037 13.3154 0.6339 0.4525 0.2003 0.6295 0.0258 0.3323 0.2987 0.0211 1.7126 0.8762 7.5190 5.2607 0.0019 0.2697 1.3620 0.2634 7.1361 0.6210 1.8352 16.3892 23.4888 5.8023 27.2613 21.8349 7.7832 158.9821 12.8121 12.5578 14.8896 114.0245 1.1016 3.9591 0.4205 27.2624 0.7161 0.2572 4.1392 1.5338 1.3153 9.8516 0.2186 0.1323 0.4229 0.1024 1.4668 0.6876 0.4180 1.6692 0.2627 0.9729 4.6027 27.1185 35.1727 12.5928 26.7595 1.0189 3.1136 10.9556 1.4028 0.2833 0.4736 1.5805 2.3268 0.3274 0.0828 0.4725 4.0404 3.4449 3.5067 0.9671 2.4467 131.3363 56.6149 10.1415 9.2972 0.2982 0.6597 7.8964 1.0538 7.4590 5.9601 19.2092 4.0607 25.4971 22.4971 14.5075 38.0791 13.3233 295.2087 0.2020 2.2493 1.4398 0.3438 125.4701 36.9387 47.9248 0.0090 0.0310 0.3287 1.6428 10.9462 33.1234 96.4143 86.3203 43.5277 9.1661 1.5961 16.3809 0.7056 1.5940 112.5378 48.8290
temp: 298.150 k
press: 1.00000 atm
elementType: 8 7 7 6 6 6 6 6 6 6 6 6 6 6 6 6 6 1 1 1 1 1 1 1 1 1 1 1 1 1 1 1 1 1 1 1 1 1 1 1
symmnumber: 1
zpe: 917851.2 jmol-1
zpe.correction: 0.349591 hartree
zpe.thermalcorrener: 0.368614 hartree
zpe.thermalcorrenthalpy: 0.369558 hartree
zpe.thermalcorrgfe: 0.298248 hartree
zpe.sumelectzpe: -730.483750 hartree
zpe.sumelectthermal: -730.464727 hartree
zpe.sumelectthermalent: -730.463783 hartree
zpe.sumelectthermalfe: -730.535092 hartree
dipole: 12.9608 -5.7505 -0.8985
dipole: 14.2077
quadrupole: -9.9974 -90.5564 -99.1981
quadrupole: -7.9934 -13.8065 0.5274
quadrupole: 56.5865 -23.9724 -32.6141 -7.9934 -13.8065 0.5274
hfenergy: -730.8333407 hartree
pointgroup: C01 [X(C14H23N2O1)]
dipole: 5.1634307 -2.1402978 0.0576501 debye
polarizability: 249.3589096|6.1681417|164.3374223|-14.950984|5.6885106|114.7741274 unknown
InChI: InChI=1S/C14H23N2O/c1-2-3-4-5-6-7-10-16-11-8-9-13(12-16)14(15)17/h8-9,11-12H,2-7,10,15H2,1H3
charge 1 multiplicity 1
40 atoms
O  3.445651 2.857613 0.469268
N  1.623843 -0.804925 0.720649
N  5.50288 2.016994 -0.21177
C  -3.330803 -0.061004 -0.21322
C  -2.258457 -0.490958 0.815098
C  -4.762941 -0.099105 0.367625
C  -0.830341 -0.449609 0.220728
C  -5.837752 0.353247 -0.646648
C  0.221778 -0.841786 1.281393
C  -7.270346 0.317979 -0.066102
C  -8.339207 0.778667 -1.079903
C  2.29797 0.385352 0.683661
C  2.180743 -1.946691 0.188213
C  3.585117 0.481464 0.118793
C  3.454206 -1.90572 -0.3932
C  4.169767 -0.685436 -0.429826
C  4.182545 1.882404 0.137423
H  -3.278571 -0.721702 -1.103041
H  -3.108771 0.965896 -0.569704
H  -2.315528 0.176511 1.699282
H  -2.486173 -1.515242 1.174864
H  -4.813702 0.550498 1.266093
H  -4.995012 -1.128325 0.712013
H  -0.766864 -1.138488 -0.644674
H  -0.61678 0.570019 -0.156325
H  -5.793296 -0.29384 -1.547438
H  -5.610005 1.383593 -0.991014
H  0.041601 -1.863134 1.658957
H  0.190196 -0.147947 2.139079
H  -7.501685 -0.711988 0.273997
H  -7.314014 0.961207 0.836371
H  -9.352019 0.74427 -0.639807
H  -8.15194 1.817007 -1.412278
H  -8.340801 0.133489 -1.978503
H  1.816823 1.277509 1.09533
H  1.584343 -2.859271 0.247777
H  3.876446 -2.822254 -0.811177
H  5.15874 -0.666217 -0.897783
H  5.897636 2.959609 -0.210032
H  6.126525 1.240115 -0.422971
