program: Gaussian 09
title: 000200699
version: EM64L-G09RevD.01
frameworkgroup: C1[X(C22H29ClN2O)]
method: RPBEPBE
basis: SDD
operation: Freq
keyword: #p
keyword: freq=noraman
keyword: PBEPBE/SDD
title: #p freq=noraman PBEPBE/SDD
converged: YES YES NO NO
title: Mulliken charges:
elementType: Cl O N N C C C C C C C C C C C C C C C C C C C C C C H H H H H H H H H H H H H H H H H H H H H H H H H H H H H
charge: -0.069339 -0.264643 -0.072721 -0.194300 -0.375705 -0.367067 -0.403928 -0.414619 -0.336736 -0.392554 0.303031 -0.393381 0.130951 -0.363987 0.367515 -0.317657 -0.838624 -0.248837 -0.454305 -0.828592 0.369012 -0.330135 -0.364155 -0.206271 -0.185896 -0.117155 0.183676 0.208860 0.200618 0.186670 0.228455 0.213961 0.190923 0.226924 0.205404 0.176196 0.199268 0.210550 0.214791 0.212892 0.241523 0.207279 0.209843 0.226510 0.221667 0.256339 0.219516 0.228869 0.227523 0.229132 0.225790 0.253906 0.256163 0.251527 0.255325
chargesum: 0.00000
title: Mulliken charges with hydrogens summed into heavy atoms:
elementType: Cl O N N C C C C C C C C C C C C C C C C C C C C C C
charge: -0.069339 -0.264643 -0.072721 -0.194300 0.016831 0.020221 0.038488 0.003227 0.044865 0.017264 0.303031 0.034302 0.130951 -0.122464 0.367515 0.099466 -0.134109 -0.029322 -0.225436 -0.146148 0.369012 -0.076229 -0.107991 0.045257 0.069428 -0.117155
polarizability: 4.12118297e+02 -4.70235029e+00 2.53921747e+02 -1.87816743e+00 7.97166063e+00 1.51572839e+02
1716.lowfreq: -11.6810 -6.0530 -0.0024 -0.0018 -0.0013 2.5324 10.8515 12.3013 17.2631
frequency: 9.4427 12.1967 15.9274 32.2022 47.7208 65.9156 70.0780 87.4960 93.9263 100.8084 123.4687 138.5079 146.7516 154.0115 163.7328 175.9293 194.8070 219.6468 235.2830 257.5399 263.6177 276.7766 289.1495 317.1178 323.2181 337.1772 347.3765 358.2637 382.3368 400.3890 416.1396 453.0941 471.6940 487.7517 497.7357 498.8714 505.2813 512.3068 546.9919 584.6349 603.0453 622.2834 640.1892 675.2462 696.4844 724.5963 750.8056 766.8113 783.2441 790.0446 793.8195 798.1182 814.1732 823.5836 824.7562 849.1302 881.4242 919.8771 928.8503 939.1202 951.6226 952.7965 963.5312 968.6999 988.7127 990.2732 1002.4467 1023.7384 1037.6205 1048.9534 1051.7584 1053.5895 1059.8263 1070.9402 1084.7737 1088.5835 1101.7390 1105.7741 1108.8867 1123.7010 1138.6504 1148.4108 1163.0909 1174.3067 1181.4617 1193.3926 1199.3168 1206.5280 1222.2069 1237.2305 1248.8750 1255.4710 1262.7629 1277.5610 1283.6313 1288.3096 1290.3730 1301.8105 1330.5499 1337.7730 1343.7022 1347.6736 1361.8175 1367.0884 1370.6842 1378.9467 1385.9119 1387.5039 1395.2086 1398.0087 1405.3490 1442.4730 1448.9150 1451.9369 1459.0320 1460.9797 1464.2280 1467.8640 1468.4617 1469.1408 1473.0054 1474.5267 1482.6668 1484.2284 1491.8372 1491.9270 1583.6163 1594.2885 1596.8535 1604.5700 2832.0006 2846.8080 2859.9448 2888.8041 2907.1194 2945.7788 2958.8957 2967.7579 2977.8172 2993.3082 3003.2390 3005.9469 3027.4787 3032.8507 3039.4965 3042.8127 3043.5873 3053.3365 3064.5279 3079.5826 3082.7019 3085.2654 3118.4139 3137.8135 3156.2732 3158.2107 3158.4112 3174.8688 3179.1713
redmass: 5.0876 4.0580 4.8179 5.6589 5.2204 4.0604 2.8801 2.0253 3.8152 4.5905 5.5848 3.5607 1.0700 2.8886 3.0611 2.4874 1.1865 3.6694 3.2656 5.4659 2.2124 2.9593 3.2193 7.0980 2.9364 2.2920 4.1846 3.3073 3.1955 2.3225 3.0122 4.6507 2.9663 3.8265 3.7888 2.7470 3.1492 3.5143 5.2140 3.5338 3.1079 7.0237 7.2212 2.7494 3.4179 2.1453 1.0855 3.9099 1.6562 3.9825 5.8918 1.2819 1.2147 1.6699 3.0201 1.5328 1.3646 1.4169 1.4036 1.9281 1.4457 1.7999 1.4071 4.8318 1.4332 3.9719 2.7852 1.4374 2.1090 2.4573 1.7440 2.4725 2.1912 2.5918 2.3197 2.0457 2.5527 1.9090 1.3116 2.2983 2.4491 2.7170 1.7581 1.1771 1.3451 1.3965 1.8084 1.8818 4.0195 1.5094 1.3050 1.4631 1.6052 1.3143 1.1097 1.2884 1.2655 1.2956 1.3579 1.2918 1.8027 1.4933 2.7853 3.7576 1.5070 1.7291 1.6595 1.2870 1.4544 1.2260 3.7926 1.6498 1.7076 1.0851 1.1821 1.1317 1.2320 1.3143 1.1192 1.1270 1.3599 1.1940 1.1893 1.3049 1.1321 1.0781 7.4251 6.5618 5.9212 6.5812 1.0707 1.0712 1.0694 1.0694 1.0714 1.0551 1.0418 1.0383 1.0601 1.0603 1.1059 1.0854 1.0895 1.1007 1.0919 1.0896 1.0944 1.0897 1.1049 1.0981 1.0962 1.0922 1.0857 1.0920 1.0878 1.0976 1.0884 1.0965 1.0977
irintensity: 0.0401 0.4307 0.1947 0.1133 0.1080 0.2261 0.7598 0.4748 0.0837 0.0133 0.5587 0.1553 0.7920 4.8700 0.9061 4.6346 0.2855 0.2076 6.5460 1.3097 4.7923 4.0355 0.7048 2.4421 4.0023 0.3484 4.9078 5.5434 0.2580 0.9429 0.0244 1.3905 1.5257 1.3007 0.5766 22.9606 2.1394 1.8376 1.5030 0.5764 2.1083 0.3963 62.7458 5.1745 0.6126 17.6797 7.2077 5.1884 49.9574 4.6672 3.9095 12.2123 0.3170 71.5379 6.8773 0.2439 0.3923 0.4970 0.3606 6.4730 4.6345 19.3988 11.1932 86.6276 14.3514 34.4721 19.6476 7.9168 49.8511 1.5662 2.2781 0.1266 17.0786 41.0115 19.0022 5.6281 11.9833 34.1454 16.3279 15.4254 59.9865 25.5472 7.5653 58.9562 2.5092 3.0028 2.3242 8.3767 304.4019 69.7534 10.3373 21.0893 4.5778 8.4710 6.5106 9.3991 1.0457 20.0132 2.7770 14.4187 18.3885 12.2090 8.1961 0.4017 24.8512 28.7691 28.1911 5.7516 9.2761 17.4605 1.1290 33.8116 5.5210 3.0252 24.1190 12.0845 13.0239 83.9143 21.6244 54.4329 90.0666 22.3174 28.9554 30.0567 5.8649 29.0540 15.9976 32.5934 53.7850 26.8548 58.0443 60.7445 115.9754 78.6778 108.2193 29.4728 38.3511 37.8160 11.9683 29.8558 23.8039 23.2922 39.8278 19.6848 42.2124 48.6111 6.2909 25.5259 90.1605 35.3340 17.2998 5.4053 4.3593 35.7698 9.9286 22.6035 1.7458 9.6849 0.9826
temp: 298.150 k
press: 1.00000 atm
elementType: 17 8 7 7 6 6 6 6 6 6 6 6 6 6 6 6 6 6 6 6 6 6 6 6 6 6 1 1 1 1 1 1 1 1 1 1 1 1 1 1 1 1 1 1 1 1 1 1 1 1 1 1 1 1 1
symmnumber: 1
zpe: 1215018.7 jmol-1
zpe.correction: 0.462776 hartree
zpe.thermalcorrener: 0.488906 hartree
zpe.thermalcorrenthalpy: 0.489850 hartree
zpe.thermalcorrgfe: 0.402338 hartree
zpe.sumelectzpe: -1498.544028 hartree
zpe.sumelectthermal: -1498.517898 hartree
zpe.sumelectthermalent: -1498.516954 hartree
zpe.sumelectthermalfe: -1498.604466 hartree
dipole: 2.8525 -0.7540 0.0457
dipole: 2.9509
quadrupole: -205.1125 -154.0834 -168.5476
quadrupole: -2.1733 0.3979 -0.2504
quadrupole: -29.1980 21.8311 7.3669 -2.1733 0.3979 -0.2504
hfenergy: -1499.0068041 hartree
pointgroup: C01 [X(C22H29Cl1N2O1)]
dipole: 1.1159582 -0.3195589 0.0185517 debye
polarizability: 411.7402604|-8.185133|254.7690886|-5.217985|2.4887271|151.1035334 unknown
InChI: InChI=1S/C22H29ClN2O/c1-18-6-5-7-22(19(18)2)25-15-13-24(14-16-25)12-3-4-17-26-21-10-8-20(23)9-11-21/h5-11H,3-4,12-17H2,1-2H3
charge 0 multiplicity 1
55 atoms
Cl -10.70826 1.359721 0.040716
O  -5.155921 -0.997458 -0.023708
N  1.096042 -0.568861 0.381892
N  3.88945 0.044809 -0.10815
C  2.173013 -1.516541 0.769056
C  1.522648 0.235084 -0.791187
C  3.475105 -0.758818 1.071103
C  2.825475 0.997435 -0.488861
C  -0.199373 -1.261503 0.174684
C  -1.411644 -0.307034 0.177008
C  5.251208 0.498943 -0.149397
C  -2.743907 -1.083729 0.069418
C  6.312764 -0.45415 -0.301714
C  5.556943 1.886756 -0.080082
C  7.663372 0.003138 -0.312195
C  -3.95416 -0.148788 0.09625
C  6.004318 -1.926514 -0.51274
C  6.893942 2.328266 -0.122518
C  7.942972 1.390303 -0.217902
C  8.81416 -0.98039 -0.45837
C  -6.408064 -0.368732 -0.002693
C  -6.605124 1.029912 0.12428
C  -7.525253 -1.23541 -0.117991
C  -7.918716 1.55521 0.137311
C  -8.832311 -0.712883 -0.105534
C  -9.012727 0.680725 0.022992
H  2.372839 -2.266621 -0.039344
H  1.849934 -2.065054 1.673826
H  0.733516 0.96841 -1.035748
H  1.684331 -0.413986 -1.690089
H  4.27166 -1.473254 1.331439
H  3.310711 -0.095388 1.952727
H  2.617967 1.737664 0.321378
H  3.14462 1.549549 -1.390536
H  -0.324008 -1.984139 1.005174
H  -0.200875 -1.859653 -0.774825
H  -1.338388 0.410828 -0.664196
H  -1.382391 0.287146 1.111116
H  -2.769489 -1.672839 -0.867551
H  -2.833314 -1.804101 0.905253
H  4.750113 2.618124 0.030826
H  -3.922379 0.570552 -0.749154
H  -3.994819 0.421726 1.047803
H  6.693075 -2.373193 -1.251644
H  6.108268 -2.522283 0.417116
H  4.970838 -2.047095 -0.880892
H  7.11701 3.399657 -0.060886
H  8.985037 1.73071 -0.232291
H  8.806081 -1.476454 -1.448942
H  9.785283 -0.467498 -0.352086
H  8.768288 -1.783644 0.300859
H  -5.760104 1.71802 0.213572
H  -7.350501 -2.310884 -0.215156
H  -8.079026 2.632888 0.235763
H  -9.696135 -1.377876 -0.193783
