program: Gaussian 09
title: 000200735
version: EM64L-G09RevD.01
frameworkgroup: C1[X(C21H26N2O2)]
method: RPBEPBE
basis: SDD
operation: Freq
keyword: #p
keyword: freq=noraman
keyword: PBEPBE/SDD
title: #p freq=noraman PBEPBE/SDD
converged: YES YES NO NO
title: Mulliken charges:
elementType: O O N N C C C C C C C C C C C C C C C C C C C C C H H H H H H H H H H H H H H H H H H H H H H H H H H
charge: -0.429971 -0.271503 -0.040493 -0.237255 0.219411 -0.232333 -0.234453 -0.153395 -0.169802 -0.542246 -0.532948 -0.405197 0.240278 -0.638485 0.445210 0.246772 -0.432379 -0.443287 0.152562 -0.361125 -0.359636 -0.255652 -0.222659 -0.791038 -0.742963 0.233467 0.262086 0.203027 0.249869 0.221066 0.242251 0.246269 0.233622 0.229087 0.187441 0.229176 0.229546 0.244193 0.230047 0.240617 0.207792 0.307423 0.225112 0.332324 0.227244 0.268051 0.239479 0.230414 0.219778 0.231614 0.221591
chargesum: 0.00000
title: Mulliken charges with hydrogens summed into heavy atoms:
elementType: O O N N C C C C C C C C C C C C C C C C C C C C C
charge: -0.097647 -0.271503 -0.040493 -0.237255 0.219411 0.001134 0.027633 0.049633 0.080067 -0.078930 -0.053058 0.011330 0.240278 -0.179762 0.445210 0.246772 0.041861 -0.202670 0.152562 -0.153333 -0.052213 -0.030540 0.004586 -0.053093 -0.069980
polarizability: 2.86023499e+02 1.70221620e+01 2.43137809e+02 -1.70099384e+01 -1.59276489e+01 1.79976031e+02
1716.lowfreq: -15.7001 -10.8578 -0.0010 -0.0006 0.0003 5.1705 37.4764 43.2062 72.5687
frequency: 37.3438 43.1192 72.5499 76.7449 82.1048 86.1559 97.0106 119.0398 125.3045 135.0979 151.7884 173.5421 184.8543 222.1412 233.1514 249.5751 274.6554 278.6864 293.9833 320.5437 326.8506 342.9772 365.9022 402.5072 405.4667 417.1807 436.0325 442.8456 477.2050 508.7851 517.3454 519.0961 550.4426 552.7298 557.9125 591.7851 611.4412 634.0435 650.7124 675.1849 687.7916 738.7157 751.4928 759.9673 770.8901 775.9687 800.6657 843.3315 848.4246 861.9256 882.4659 902.3424 906.1394 927.3368 946.3580 949.9242 956.8402 961.1422 972.5552 988.5731 992.2674 998.7380 1013.4693 1019.4139 1022.9175 1025.2210 1039.5831 1041.4400 1059.9719 1071.3949 1077.3625 1088.2942 1094.2413 1104.2668 1115.7144 1127.5133 1131.1671 1156.8832 1168.7252 1169.8734 1174.7393 1190.9153 1197.9260 1233.5801 1237.9020 1249.0536 1266.1840 1271.6774 1281.8747 1287.9853 1295.9970 1304.5719 1305.8170 1312.1907 1326.4149 1331.3284 1339.0195 1345.7153 1353.4310 1356.8771 1362.5384 1368.4472 1375.8166 1379.5341 1396.4498 1402.9822 1447.6690 1449.2864 1455.2971 1464.9621 1467.3566 1467.8319 1469.9423 1473.6421 1476.2611 1493.9644 1496.9442 1578.8691 1601.3311 1613.4294 1677.4662 2902.0994 2946.7990 2950.6378 2965.4727 2968.0515 2989.0189 3000.9711 3002.8862 3004.2096 3017.1253 3021.1238 3033.8312 3037.5055 3048.3406 3062.6227 3067.2252 3075.5070 3076.4282 3086.9997 3097.7331 3125.6890 3130.0035 3138.2875 3160.2126 3202.9622 3557.3703
redmass: 4.6857 4.2749 6.1287 3.9621 3.8783 2.4319 1.1845 1.1371 2.9736 2.9976 3.2179 3.9141 3.2804 3.0886 3.2547 3.1429 1.3051 3.8523 3.1202 3.4879 3.0523 3.9102 4.1028 3.5745 2.5952 2.8592 3.9558 3.7039 3.1577 4.9498 3.6301 2.9028 3.7124 3.6348 3.4824 3.6887 4.6667 5.1998 3.9862 3.8882 4.0885 3.3103 4.4679 2.1157 1.9414 2.6141 2.6677 1.7757 1.4099 2.4879 1.3786 2.6852 3.3089 2.2794 2.1766 1.7629 2.4247 2.2464 2.7406 1.3123 2.1029 2.0752 2.3629 2.3162 2.1286 1.6764 1.5114 2.4214 3.4156 2.1279 2.4844 2.2160 1.9490 2.6707 2.5946 1.6326 2.0909 1.5322 1.2499 1.4432 1.4930 1.6784 2.7248 1.5834 1.6516 2.4186 1.3982 1.5032 1.3235 1.5436 1.3683 1.2964 1.6093 1.2995 1.3208 1.4921 1.3906 1.4942 1.3422 1.4664 1.5748 1.4850 1.2585 2.3575 1.2202 4.6438 1.8433 1.3160 1.0829 1.0516 1.0952 1.2576 1.0824 2.0709 1.0828 1.0798 1.0875 6.7227 7.4693 7.5956 7.1082 1.0714 1.0820 1.0842 1.0401 1.0674 1.0384 1.0662 1.0789 1.0797 1.0724 1.0681 1.0968 1.0860 1.0876 1.0944 1.0983 1.0971 1.1045 1.0964 1.0974 1.0864 1.0986 1.0909 1.0982 1.0948 1.0663
irintensity: 0.3636 0.4340 2.6844 3.8002 0.5818 1.9048 0.1461 0.0839 0.6328 0.2142 1.9141 2.0067 4.1780 7.8681 4.1666 1.2492 123.0165 3.8863 1.7514 1.5896 14.6057 2.1930 5.4281 1.4251 7.2860 1.1909 8.1653 1.5983 13.2471 7.9064 0.9947 1.9536 3.7679 2.6401 7.2234 3.2897 9.6390 5.1396 5.4461 2.6931 3.2006 2.4642 1.6941 29.2677 56.9561 12.7544 3.3674 10.0808 26.1678 4.5382 3.1281 1.6511 8.1495 10.2129 22.1985 26.4037 45.9241 3.2767 17.5623 0.7128 6.7294 16.3541 2.6537 11.3340 4.6008 2.5786 0.9550 6.8284 6.0157 3.6391 7.5255 14.8868 27.9806 4.1823 1.6611 9.8637 28.8143 33.0531 1.3443 1.2790 11.5605 17.0632 3.0711 5.4363 6.3978 18.6113 30.3933 0.5784 10.0341 4.1132 8.0782 1.4387 39.4350 8.1986 16.5406 9.5297 5.4498 0.1898 19.7519 2.2600 12.8469 23.6930 11.1165 136.1319 9.5763 66.5519 55.6504 17.9255 10.4406 5.9765 5.7675 31.5241 6.9952 109.3651 21.9145 15.7665 1.1404 235.8105 13.8424 22.2159 0.3816 52.5460 29.9985 53.7408 38.2234 49.5023 8.0380 36.4153 25.4658 10.5691 70.0828 36.7194 23.5500 14.3077 15.2271 41.8931 9.3212 14.8997 19.8682 42.2078 18.9029 2.6861 9.9837 18.0590 32.0964 2.7384 6.3546
temp: 298.150 k
press: 1.00000 atm
elementType: 8 8 7 7 6 6 6 6 6 6 6 6 6 6 6 6 6 6 6 6 6 6 6 6 6 1 1 1 1 1 1 1 1 1 1 1 1 1 1 1 1 1 1 1 1 1 1 1 1 1 1
symmnumber: 1
zpe: 1125970.0 jmol-1
zpe.correction: 0.428859 hartree
zpe.thermalcorrener: 0.451328 hartree
zpe.thermalcorrenthalpy: 0.452272 hartree
zpe.thermalcorrgfe: 0.378481 hartree
zpe.sumelectzpe: -1073.912454 hartree
zpe.sumelectthermal: -1073.889985 hartree
zpe.sumelectthermalent: -1073.889041 hartree
zpe.sumelectthermalfe: -1073.962832 hartree
dipole: 3.7987 -0.4001 -0.9280
dipole: 3.9308
quadrupole: -150.6180 -146.7836 -156.6850
quadrupole: 15.9520 -7.2502 0.8611
quadrupole: 0.7442 4.5786 -5.3228 15.9520 -7.2502 0.8611
hfenergy: -1074.3413129 hartree
pointgroup: C01 [X(C21H26N2O2)]
dipole: -1.4824677 -0.1573484 0.4113248 debye
polarizability: 284.2106526|-15.9833927|241.8178463|-21.3420765|19.749085|183.1088411 unknown
InChI: InChI=1S/C21H26N2O2/c1-3-14-11-22-9-8-21-17-6-4-5-7-18(17)23(13(2)25)20(21)16(12-24)15(14)10-19(21)22/h3-7,15-16,19-20,24H,8-12H2,1-2H3
charge 0 multiplicity 1
51 atoms
O  -0.483732 1.975312 -3.199671
O  2.734869 2.758704 1.29348
N  -2.037307 -2.064932 0.604414
N  1.272212 1.065293 0.643577
C  0.169331 -1.054564 0.399021
C  -0.896097 -1.898531 -0.367432
C  -0.101086 0.495779 0.404232
C  -0.770297 1.072961 -0.892068
C  -1.937921 0.143944 -1.365997
C  -1.380261 -1.262272 -1.67743
C  -0.016468 -1.621834 1.844868
C  -1.552981 -1.742539 1.981089
C  1.617043 -1.12481 -0.061628
C  -3.301813 -1.380459 0.205656
C  -3.074605 0.039005 -0.32211
C  2.248642 0.127461 0.169857
C  0.217528 1.377975 -2.047454
C  2.3628 -2.211449 -0.545911
C  1.549702 2.305947 1.218529
C  -3.795137 1.134171 0.051304
C  3.628367 0.31405 -0.053067
C  3.748023 -2.037063 -0.800934
C  4.366735 -0.790484 -0.54773
C  0.366214 3.081981 1.794415
C  -4.947863 1.20801 1.02972
H  -0.449609 -2.892692 -0.576004
H  -0.756958 0.75581 1.252667
H  -1.225981 2.047755 -0.611841
H  -2.333081 0.596697 -2.29567
H  -2.152865 -1.902068 -2.141333
H  -0.547428 -1.213225 -2.399693
H  0.437947 -0.974133 2.614715
H  0.465981 -2.614212 1.907557
H  -1.841348 -2.529086 2.703665
H  -1.988002 -0.782579 2.344032
H  -3.97725 -1.39166 1.077706
H  -3.802006 -1.987807 -0.575393
H  0.686908 0.469939 -2.455268
H  1.026425 2.047988 -1.697638
H  1.888085 -3.183752 -0.7204
H  -3.543052 2.094843 -0.42992
H  4.097608 1.27587 0.157233
H  4.341502 -2.87232 -1.188282
H  -0.778549 2.889185 -2.955822
H  5.439224 -0.670064 -0.737625
H  0.738938 4.066624 2.112461
H  -0.055521 2.563067 2.675548
H  -0.450721 3.22406 1.065472
H  -5.116486 0.259889 1.567896
H  -5.891302 1.465786 0.508574
H  -4.777755 2.00173 1.783129
