program: Gaussian 09
title: 000200697
version: EM64L-G09RevD.01
frameworkgroup: C1[X(C22H25N3O3)]
method: RPBEPBE
basis: SDD
operation: Freq
keyword: #p
keyword: freq=noraman
keyword: PBEPBE/SDD
title: #p freq=noraman PBEPBE/SDD
converged: YES YES NO NO
title: Mulliken charges:
elementType: O O O N N N C C C C C C C C C C C C C C C C C C C C C C H H H H H H H H H H H H H H H H H H H H H H H H H
charge: -0.279379 -0.233673 -0.255016 -0.110310 -0.352106 -0.043811 -0.371636 -0.336199 -0.328074 -0.306152 0.475208 -0.668975 -0.671268 0.164183 0.106033 0.117796 0.048991 0.231662 -0.352343 -0.320226 -0.346541 -0.334243 0.184738 -0.321065 -0.766811 -0.349128 -0.243637 -0.204952 0.237030 0.218422 0.226661 0.193200 0.207736 0.192264 0.240997 0.232737 0.206550 0.225150 0.209609 0.208727 0.227425 0.208865 0.258665 0.255102 0.273964 0.274606 0.271474 0.248573 0.251321 0.268756 0.260957 0.234208 0.233933
chargesum: 0.00000
title: Mulliken charges with hydrogens summed into heavy atoms:
elementType: O O O N N N C C C C C C C C C C C C C C C C C C C C C C
charge: -0.279379 -0.233673 -0.255016 -0.110310 -0.352106 -0.043811 0.083815 0.083662 0.071927 0.167582 0.475208 -0.027666 -0.026251 0.164183 0.106033 0.117796 0.048991 0.231662 -0.093677 -0.065124 -0.072576 -0.059637 0.184738 -0.049591 0.001839 -0.088171 -0.009429 0.028980
polarizability: 4.48325760e+02 -2.28516561e+01 2.37278852e+02 8.09081054e-02 -2.48598713e+00 1.87202018e+02
1716.lowfreq: -9.0588 -0.8828 -0.0005 0.0002 0.0013 2.9577 9.6544 14.7419 17.2727
frequency: 6.9485 14.6597 17.2210 27.8773 33.0545 45.8290 57.5120 69.8647 75.8816 87.5778 99.8907 101.6857 138.3263 144.0461 154.1092 174.2040 179.0061 191.9561 207.0546 251.9039 255.9406 269.8696 289.2327 297.7756 315.8738 320.0879 327.1732 348.7561 391.3254 402.3322 410.4295 418.7912 443.4445 445.2321 456.7719 477.4185 496.5278 519.0606 532.6021 538.1875 570.9950 614.6197 622.0285 637.5202 650.8060 680.0201 691.0855 693.1276 746.4017 749.4397 761.2583 784.1993 794.6625 795.5238 795.6901 810.5069 833.5568 847.1314 856.3487 873.0956 897.1711 900.8333 918.0815 979.7202 981.8110 989.4135 989.7102 994.8984 1003.1453 1005.8688 1014.3871 1026.0036 1046.5865 1047.0193 1059.8713 1070.1004 1076.7110 1079.8286 1082.0603 1085.0665 1102.8762 1110.4386 1125.8532 1163.9859 1177.0365 1183.1204 1208.7170 1213.8080 1235.3741 1237.3650 1248.3152 1250.3447 1281.9579 1291.3850 1292.0467 1295.7428 1300.0457 1310.1846 1328.9435 1363.2687 1371.4937 1378.8805 1382.9969 1388.1712 1389.1127 1391.6383 1397.8784 1405.8303 1446.5336 1446.9619 1455.5773 1457.6780 1462.4426 1463.9432 1464.8011 1472.1860 1479.9574 1485.4576 1487.8615 1491.2651 1494.9422 1561.8084 1564.1480 1579.7108 1613.0297 1616.0891 1619.3325 1624.3374 2860.4877 2869.9675 2919.9586 2982.2074 2983.2737 2997.7450 3028.0937 3036.0367 3039.0374 3053.7543 3074.3907 3076.1278 3076.3213 3090.9324 3091.7570 3128.6541 3135.1544 3135.3261 3147.3349 3149.5578 3155.6942 3164.3208 3168.4172 3174.0806 3183.6373
redmass: 4.4818 5.4029 3.8335 4.6139 4.6745 5.2174 3.9687 3.0279 3.3328 2.7281 3.9805 3.0832 6.2892 2.7771 2.0729 1.5401 1.9912 4.8223 1.2912 2.8394 1.8133 3.9792 2.1341 4.4077 3.4469 4.5257 3.8570 5.6522 2.9614 5.1046 2.8747 4.1640 5.0755 4.4267 3.0607 3.5583 3.9139 4.0903 4.0130 7.3071 5.7806 5.6109 4.9689 5.3492 5.8901 4.3424 4.7109 4.9892 2.6263 3.5908 3.1253 1.5178 1.1499 1.5613 2.2100 1.5511 3.2317 4.2488 1.3354 2.1533 1.5148 6.0570 2.0762 1.3741 1.6355 2.5888 2.2728 1.3803 1.3324 3.4291 2.8730 2.1667 2.0955 2.1329 2.6963 2.1404 2.3883 2.8115 2.5489 2.1243 1.8852 1.3476 1.7265 1.1351 1.1626 1.6780 2.2537 2.1682 3.5542 2.9735 1.8752 2.7060 1.1487 2.1007 1.1993 1.2835 1.1953 4.2999 1.3309 1.3325 1.3190 6.5441 1.3503 1.2402 1.2528 9.7032 1.2440 3.6501 1.3419 1.1365 1.8095 2.6540 1.0529 1.0545 1.0555 1.0537 1.0498 1.0732 1.0709 1.0808 2.7064 6.8380 7.2344 8.3429 8.4942 7.3670 8.4573 8.4677 1.0720 1.0714 1.0695 1.0358 1.0357 1.0383 1.0884 1.0876 1.0618 1.0888 1.0983 1.0970 1.0982 1.1004 1.1003 1.1077 1.0984 1.0865 1.0892 1.0900 1.0904 1.0955 1.0967 1.0999 1.0961
irintensity: 0.6284 0.4089 0.0552 0.3304 0.5480 0.0666 0.5214 0.4960 0.1927 0.3444 5.2931 0.1433 1.0938 1.9699 1.7776 0.1136 1.1013 0.9283 0.2494 5.6508 2.8913 1.7111 2.0900 1.4590 5.6923 20.0202 1.9852 3.3999 10.9973 3.5935 0.1600 4.5006 0.2648 0.6485 10.8733 4.7436 3.8806 8.8864 3.1035 1.3774 1.6328 8.7726 1.3881 6.2735 18.1808 34.5998 5.0458 11.6736 2.9537 10.2723 6.1548 77.4834 7.1798 6.9803 6.1837 0.3370 11.7169 12.8237 1.0312 10.4175 0.8138 39.1687 10.0769 2.8485 6.1423 5.2795 3.0770 0.1311 0.0046 31.4578 89.7109 3.8483 66.5969 43.9197 135.6218 137.3090 16.7594 46.6599 17.1116 3.6123 14.9158 9.0328 5.7978 0.1156 45.4514 6.7484 44.9170 0.8100 113.0622 86.3997 56.2129 229.6163 0.9642 6.2914 20.9745 6.6052 9.6366 210.3025 19.6373 10.3037 8.9329 2.1185 10.0830 21.5212 18.3332 29.9841 29.9375 16.3218 11.6478 25.4302 45.9703 42.0575 4.7381 2.9094 24.8012 1.3672 3.4677 14.0994 11.5647 11.0701 41.2163 244.6078 35.8967 12.2235 308.4591 38.3678 105.8921 154.5483 42.0938 147.6035 64.9295 31.9996 32.5661 15.2790 9.2000 19.3424 28.6712 19.6338 43.8241 7.8538 80.2002 36.3093 46.9570 13.1187 12.9645 2.5881 3.3659 7.1998 4.9485 11.7120 4.2222 26.5017 1.4067
temp: 298.150 k
press: 1.00000 atm
elementType: 8 8 8 7 7 7 6 6 6 6 6 6 6 6 6 6 6 6 6 6 6 6 6 6 6 6 6 6 1 1 1 1 1 1 1 1 1 1 1 1 1 1 1 1 1 1 1 1 1 1 1 1 1
symmnumber: 1
zpe: 1124064.4 jmol-1
zpe.correction: 0.428134 hartree
zpe.thermalcorrener: 0.455334 hartree
zpe.thermalcorrenthalpy: 0.456278 hartree
zpe.thermalcorrgfe: 0.365400 hartree
zpe.sumelectzpe: -1241.245710 hartree
zpe.sumelectthermal: -1241.218509 hartree
zpe.sumelectthermalent: -1241.217565 hartree
zpe.sumelectthermalfe: -1241.308444 hartree
dipole: 0.4216 -0.2022 1.2668
dipole: 1.3503
quadrupole: -138.7879 -164.3144 -165.1107
quadrupole: 4.7720 1.0550 1.1343
quadrupole: 17.2831 -8.2434 -9.0397 4.7720 1.0550 1.1343
hfenergy: -1241.6738434 hartree
pointgroup: C01 [X(C22H25N3O3)]
dipole: 0.1666989 -0.1237923 -0.4889909 debye
polarizability: 448.9917678|17.8431484|227.2839067|-7.9229133|-19.497523|196.5309562 unknown
InChI: InChI=1S/C22H25N3O3/c1-4-24(5-2)14-15-28-22(27)17-10-12-18(13-11-17)25-16(3)23-20-9-7-6-8-19(20)21(25)26/h6-13H,4-5,14-15H2,1-3H3
charge 0 multiplicity 1
53 atoms
O  3.478144 -0.239223 -0.973665
O  -2.767603 -1.444831 1.357905
O  3.418017 1.680235 0.355845
N  7.032111 -0.747309 0.230612
N  -2.92205 0.21062 -0.307712
N  -5.02868 0.924409 -1.235057
C  5.559162 -0.901883 0.237471
C  7.48209 0.492459 0.924443
C  7.771258 -1.967057 0.648309
C  4.970917 -0.170356 -0.984613
C  -1.470759 0.334485 -0.291369
C  8.816065 1.037052 0.38027
C  7.755316 -3.0749 -0.422039
C  -4.973251 -0.81442 0.540432
C  -3.707378 0.997292 -1.187543
C  -3.50246 -0.750292 0.599984
C  -5.686351 0.026535 -0.372407
C  1.336059 0.575743 -0.27635
C  -0.864638 1.391594 0.423561
C  -0.683733 -0.612839 -0.983379
C  0.537834 1.513191 0.427705
C  0.719369 -0.492877 -0.976725
C  2.819057 0.751009 -0.24318
C  -5.677617 -1.709449 1.387699
C  -2.992798 1.948346 -2.117352
C  -7.106178 -0.046255 -0.418376
C  -7.079538 -1.770436 1.332017
C  -7.792651 -0.935006 0.425332
H  5.094954 -0.50085 1.167272
H  5.293904 -1.971863 0.175874
H  6.698951 1.260467 0.783091
H  7.561274 0.328579 2.028502
H  8.820603 -1.673225 0.832233
H  7.381399 -2.370645 1.616849
H  5.267169 -0.665692 -1.921022
H  5.278744 0.889317 -0.994917
H  9.64413 0.318347 0.518704
H  8.728393 1.249996 -0.699365
H  9.092619 1.970398 0.905264
H  6.728685 -3.419033 -0.645103
H  8.20157 -2.702744 -1.360655
H  8.332764 -3.953121 -0.077539
H  -1.488889 2.098541 0.979691
H  -1.171503 -1.439886 -1.508659
H  1.035149 2.321783 0.972685
H  1.344784 -1.216351 -1.505795
H  -5.099014 -2.337423 2.073056
H  -2.234587 1.428447 -2.729857
H  -2.46726 2.74682 -1.563711
H  -3.745877 2.405108 -2.774782
H  -7.632002 0.60426 -1.123566
H  -7.626061 -2.459276 1.984628
H  -8.886316 -0.98669 0.385801
