program: Gaussian 09
title: 000200684
version: EM64L-G09RevD.01
frameworkgroup: C1[X(C17H24ClNO2)]
method: RPBEPBE
basis: SDD
operation: Freq
keyword: #p
keyword: freq=noraman
keyword: PBEPBE/SDD
title: #p freq=noraman PBEPBE/SDD
converged: NO YES NO NO
title: Mulliken charges:
elementType: Cl O O N C C C C C C C C C C C C C C C C C H H H H H H H H H H H H H H H H H H H H H H H H
charge: -0.065422 -0.485064 -0.244904 -0.098041 -0.106974 0.146514 -0.463836 -0.489645 -0.414649 -0.408422 -0.420519 0.394145 -0.335333 -0.339760 -0.384408 -0.386286 -0.326377 -0.322241 -0.239079 -0.205834 -0.115285 0.202828 0.250094 0.184250 0.239176 0.207151 0.216490 0.227052 0.194109 0.211575 0.187704 0.219780 0.333928 0.201838 0.197782 0.192966 0.210865 0.227113 0.296256 0.214309 0.187331 0.189162 0.214030 0.252679 0.252951
chargesum: 0.00000
title: Mulliken charges with hydrogens summed into heavy atoms:
elementType: Cl O O N C C C C C C C C C C C C C C C C C
charge: -0.065422 -0.151135 -0.244904 -0.098041 0.095854 0.146514 -0.029493 -0.043317 0.028892 -0.002737 -0.013035 0.394145 0.064288 0.064071 -0.157295 -0.090031 0.075263 0.080951 0.013600 0.047118 -0.115285
polarizability: 2.24209557e+02 3.42538298e+01 1.98929272e+02 -1.90009530e+00 2.62420859e+00 1.76540830e+02
1716.lowfreq: -18.0657 -12.1267 -3.1832 -0.0016 -0.0014 -0.0010 4.5203 22.4641 38.9969
frequency: -15.6855 22.0446 38.9807 54.5081 73.5600 86.2029 126.3256 147.8468 161.3000 199.1230 214.7517 225.8507 232.5026 272.0164 283.0577 293.2016 301.9498 318.1929 332.1320 348.3285 386.1440 395.7263 408.8994 417.1832 444.7216 464.9932 467.6821 489.3852 509.0010 539.8580 557.2835 606.8961 626.2191 663.0742 716.8358 718.6768 769.5877 789.0722 808.9505 811.5922 821.0651 837.1916 838.9084 864.4268 876.9100 895.5901 897.0777 945.9471 948.6038 963.4639 971.9818 984.5182 999.0354 1003.0742 1027.4108 1049.3816 1051.4397 1061.1486 1073.4624 1075.7652 1094.4484 1099.1731 1102.7227 1109.6131 1118.6516 1133.3710 1136.6150 1144.8377 1162.7900 1184.9779 1187.7488 1204.3318 1225.4970 1231.7914 1260.6657 1265.5485 1280.9511 1285.8232 1289.7563 1291.9066 1305.8359 1309.5034 1326.7706 1332.0772 1337.3898 1340.7559 1342.8530 1351.3406 1359.6776 1368.6849 1369.9657 1386.7601 1389.3670 1441.5448 1445.2588 1447.3883 1447.8959 1456.5732 1468.6704 1474.2716 1475.7822 1477.0408 1484.9834 1584.0038 1599.4430 2858.5736 2866.2819 2885.0829 2942.9016 2947.6662 2949.7629 2952.8600 2964.0453 2969.6692 2987.1716 3024.4791 3030.0003 3030.3410 3030.7044 3035.6107 3050.3874 3053.6387 3078.9115 3082.4095 3128.2966 3161.1535 3167.0960 3187.3361 3576.3341
redmass: 3.1032 6.8381 3.7288 4.5298 4.1087 3.7867 5.5495 4.2032 3.9294 2.7623 5.3878 5.4218 1.8129 1.6571 1.6987 4.5658 2.8391 2.6008 2.6088 2.3083 2.4852 2.4865 2.9283 3.3066 5.2720 4.7202 3.1456 2.5483 3.3660 2.6270 2.6550 1.9707 7.1471 3.4178 4.6843 3.8375 3.1006 2.1812 3.5286 1.9535 1.4936 1.6084 1.3557 2.2410 2.0585 2.2148 2.0035 1.4693 1.5957 2.5578 2.0136 1.4017 3.6386 2.7564 2.1712 1.6081 2.1014 2.8054 2.6313 2.7069 2.1417 1.5623 2.4784 1.8897 1.9054 2.0210 2.3609 1.8172 2.7501 1.1669 1.0679 1.5344 1.3532 1.2892 1.3765 1.2690 1.3716 1.3872 1.2966 1.2598 1.4974 1.2335 1.3336 1.4286 1.3959 1.3050 1.5017 1.6845 1.4305 5.0212 1.2909 1.4650 3.5127 1.0823 1.0809 1.0970 1.0954 1.0956 1.0931 1.1056 2.2959 1.0870 1.0856 7.7654 6.3478 1.0705 1.0694 1.0686 1.0705 1.0669 1.0683 1.0668 1.0788 1.0630 1.0619 1.0895 1.0895 1.0915 1.0893 1.0996 1.0925 1.1016 1.0955 1.0974 1.0886 1.0901 1.0953 1.0950 1.0651
irintensity: 0.1066 0.0637 0.0539 0.6130 1.7859 0.4895 2.2436 0.6163 3.8281 6.5393 1.9520 9.2633 1.9017 92.3646 47.0490 2.4252 11.3512 5.9568 1.5740 4.2784 0.9645 0.5562 0.3026 2.3460 9.2192 21.8996 8.3219 0.9768 5.2602 8.7090 5.9891 10.7259 0.2270 3.6647 11.5962 3.9481 3.2282 7.2510 24.1373 14.0561 51.0817 0.7900 26.5553 12.0124 19.5192 28.3014 8.9211 3.2003 8.4757 6.4411 13.8463 1.0798 41.6053 25.0763 8.4155 2.0214 20.9017 1.2107 38.3498 32.8198 11.6542 7.8066 5.9917 22.0785 25.4186 20.5463 26.0709 45.7609 10.5002 1.1622 1.8295 1.1881 2.8085 27.5245 8.6656 2.5858 11.0499 3.6366 0.3607 3.5339 9.9264 2.8156 1.7970 3.6429 1.7857 9.9689 1.5899 11.6610 4.8273 9.6216 2.6930 1.6139 10.5233 2.5680 2.2192 5.9109 18.6066 6.3931 16.1837 14.2330 80.7964 7.4739 12.5327 2.2273 5.4243 44.9201 57.9844 116.8597 9.7325 32.7742 35.9070 103.1922 16.4844 45.7586 23.3361 23.2045 71.6036 30.7194 32.4944 68.3582 18.8810 41.9652 40.6567 35.0038 15.7532 2.7904 3.8112 1.7565 2.7098
temp: 298.150 k
press: 1.00000 atm
elementType: 17 8 8 7 6 6 6 6 6 6 6 6 6 6 6 6 6 6 6 6 6 1 1 1 1 1 1 1 1 1 1 1 1 1 1 1 1 1 1 1 1 1 1 1 1
symmnumber: 1
zpe: 996524.2 jmol-1
zpe.correction: 0.379556 hartree
zpe.thermalcorrener: 0.398733 hartree
zpe.thermalcorrenthalpy: 0.399677 hartree
zpe.thermalcorrgfe: 0.331676 hartree
zpe.sumelectzpe: -1325.824708 hartree
zpe.sumelectthermal: -1325.805532 hartree
zpe.sumelectthermalent: -1325.804587 hartree
zpe.sumelectthermalfe: -1325.872588 hartree
dipole: 1.7544 3.8066 -0.5864
dipole: 4.2323
quadrupole: -153.3367 -137.8231 -124.0716
quadrupole: 5.2051 2.7000 -2.1284
quadrupole: -14.9262 0.5874 14.3389 5.2051 2.7000 -2.1284
hfenergy: -1326.2042644 hartree
pointgroup: C01 [X(C17H24Cl1N1O2)]
dipole: 0.4485274 1.5893172 -0.2132394 debye
polarizability: 212.7667624|36.3724034|210.5021359|-0.8366517|3.7539589|176.4107607 unknown
InChI: InChI=1S/C17H24ClNO2/c18-16-6-4-14(5-7-16)17(20)8-2-1-3-15(17)13-19-9-11-21-12-10-19/h4-7,15,20H,1-3,8-13H2
charge 0 multiplicity 1
45 atoms
Cl -4.80672 -3.386184 -0.488891
O  -1.026888 1.768256 1.687029
O  4.681204 -2.285643 -0.168021
N  2.464368 -0.477201 0.379277
C  0.518793 1.05876 -0.142094
C  -0.965043 1.402739 0.249465
C  1.42471 2.312292 -0.049511
C  -1.479148 2.603389 -0.60477
C  1.066488 -0.106429 0.718181
C  0.896705 3.48082 -0.91073
C  -0.556112 3.841752 -0.524933
C  -1.905414 0.203164 0.081117
C  2.573209 -1.199968 -0.914879
C  3.101431 -1.275816 1.459775
C  -2.056385 -0.414362 -1.187422
C  -2.660168 -0.294878 1.170821
C  4.047695 -1.494776 -1.235312
C  4.569972 -1.562686 1.110627
C  -2.933652 -1.505402 -1.3704
C  -3.54451 -1.385207 1.006801
C  -3.66686 -1.975414 -0.264039
H  0.492215 0.744556 -1.207176
H  2.448291 2.023014 -0.346794
H  1.506196 2.633786 1.012169
H  -2.502449 2.851406 -0.26595
H  -1.556557 2.281444 -1.661553
H  0.382748 -0.986151 0.631845
H  1.043834 0.212729 1.777384
H  0.925211 3.18835 -1.981051
H  1.555195 4.364003 -0.803708
H  -0.572774 4.271273 0.500463
H  -0.951437 4.635575 -1.186777
H  -0.525892 2.61281 1.809052
H  2.149235 -0.575852 -1.723639
H  2.000773 -2.16225 -0.890247
H  2.569712 -2.247847 1.620681
H  3.053017 -0.701099 2.404146
H  -1.489779 -0.052177 -2.05339
H  -2.547406 0.18146 2.147227
H  4.141895 -2.10518 -2.148807
H  4.596944 -0.536799 -1.366812
H  5.131257 -0.604997 1.048033
H  5.038137 -2.21973 1.86224
H  -3.045316 -1.977002 -2.351045
H  -4.124822 -1.765428 1.852616
