program: Gaussian 09
title: 000200643
version: EM64L-G09RevD.01
frameworkgroup: C1[X(C9H9N3OS)]
method: RPBEPBE
basis: SDD
operation: Freq
keyword: #p
keyword: freq=noraman
keyword: PBEPBE/SDD
title: #p freq=noraman PBEPBE/SDD
converged: NO YES NO NO
title: Mulliken charges:
elementType: S O N N N C C C C C C C C C H H H H H H H H H
charge: 0.005192 -0.417582 -0.241376 -0.125127 -0.011923 0.478381 -0.177452 -0.209713 -0.377016 -0.340815 -0.299196 -0.210778 -0.208433 -0.237155 0.284691 0.248939 0.282032 0.236917 0.251248 0.234859 0.236318 0.236535 0.361456
chargesum: 0.00000
title: Mulliken charges with hydrogens summed into heavy atoms:
elementType: S O N N N C C C C C C C C C
charge: 0.005192 -0.056126 -0.241376 -0.125127 -0.011923 0.478381 -0.177452 0.074978 -0.128077 -0.058783 0.188968 0.024081 0.027885 -0.000620
polarizability: 1.89847148e+02 -1.78626228e+00 1.41940707e+02 -5.20103762e+00 -6.75405255e+00 7.38758424e+01
1716.lowfreq: -12.3499 -0.0029 0.0006 0.0007 2.2787 6.2999 50.0007 52.5974 82.5917
frequency: 49.9723 52.5779 82.5597 114.1494 143.7964 202.0618 221.3855 263.3747 303.0164 356.1366 406.8811 428.8365 470.0609 512.7446 559.4177 570.3206 610.0814 623.6450 646.2265 674.1283 696.0679 751.2291 769.3934 794.8476 838.8154 917.5097 924.5790 959.1405 971.9039 986.9836 989.0821 997.0371 1023.5241 1045.5547 1083.0833 1105.9840 1151.3000 1176.3336 1190.4001 1221.8158 1230.2621 1281.8786 1317.3576 1336.3061 1348.2996 1373.0959 1387.5939 1416.6257 1443.9288 1449.8361 1480.1459 1491.4186 1598.1952 1611.4273 2996.7046 3135.0277 3138.7784 3143.3654 3155.4220 3169.5652 3182.6242 3261.6226 3412.0048
redmass: 4.4357 6.9636 5.5802 3.9067 6.7124 6.9018 5.3091 3.3100 6.4766 6.2143 2.8601 6.3561 3.9115 4.8451 3.4445 1.3743 6.2087 7.4735 4.9746 5.9794 1.9679 4.9071 1.8348 1.3864 1.2476 1.4200 3.3947 3.7753 1.3865 5.8562 5.3814 1.3664 2.5633 2.1088 1.6689 3.0036 3.9469 1.0516 1.1183 1.8774 1.5897 4.8820 1.4333 1.7586 3.2927 1.6141 7.2736 1.4120 1.1813 2.1319 4.1058 3.0044 6.6009 6.0932 1.0672 1.0856 1.0977 1.0891 1.0942 1.0983 1.0982 1.1000 1.0652
irintensity: 0.1504 1.3232 2.8152 6.1941 0.5224 0.8809 7.0529 3.5813 1.5754 0.7080 0.4140 8.7910 10.0182 9.1982 18.8489 202.8925 1.8014 2.7919 3.4643 6.4189 45.4382 107.9338 67.3486 13.7646 1.6143 3.1160 8.8773 35.8597 2.1523 127.5229 3.3406 0.1413 4.1533 7.1921 7.8016 11.5487 61.5647 0.2029 0.1380 73.7182 125.4713 37.6849 34.8230 87.3448 11.8313 79.7826 15.7422 37.2902 14.4398 14.1130 6.6350 132.7762 5.9953 19.8985 42.4650 1.7300 5.5260 5.0430 21.7042 16.7377 3.9557 2.0852 46.3225
temp: 298.150 k
press: 1.00000 atm
elementType: 16 8 7 7 7 6 6 6 6 6 6 6 6 6 1 1 1 1 1 1 1 1 1
symmnumber: 1
zpe: 450079.7 jmol-1
zpe.correction: 0.171426 hartree
zpe.thermalcorrener: 0.183385 hartree
zpe.thermalcorrenthalpy: 0.184329 hartree
zpe.thermalcorrgfe: 0.132134 hartree
zpe.sumelectzpe: -984.876126 hartree
zpe.sumelectthermal: -984.864168 hartree
zpe.sumelectthermalent: -984.863223 hartree
zpe.sumelectthermalfe: -984.915419 hartree
dipole: -4.1191 -1.8275 -1.5967
dipole: 4.7809
quadrupole: -84.1880 -88.0958 -91.0347
quadrupole: 2.4468 -7.5525 -3.2823
quadrupole: 3.5848 -0.3229 -3.2619 2.4468 -7.5525 -3.2823
hfenergy: -985.0475524 hartree
pointgroup: C01 [X(C9H9N3O1S1)]
dipole: 1.5979776 -0.6791905 0.7232496 debye
dipolederiv: -0.4442314 0.0584543 -0.0227503 0.1231422 -0.7419205 0.1925216 -0.1287472 0.1902949 -0.3097784 -0.8005955 0.1708544 -0.0085305 0.1626206 -0.3301619 0.0225057 -0.2232356 0.0289791 -0.669677 -1.044281 0.358399 -0.054693 -0.1250587 -0.5866815 0.1872062 0.1095572 0.185159 -0.0709844 -0.7404784 -0.3463235 0.110805 0.2231621 -0.4778486 0.1653766 0.0375225 0.1906962 -0.2411482 -0.5504679 -0.0883846 0.054992 -0.3928804 -0.1098007 0.0159131 0.0591994 -0.0223709 -0.1767877 0.9779441 -0.1029854 -0.0651852 0.2493273 0.0286699 0.0678334 -0.1613854 0.0617457 0.0834418 0.6139741 -0.0240496 -0.0271064 -0.3808012 1.2431101 -0.4938743 0.0492566 -0.4714587 0.1210544 0.3519226 0.1886824 -0.0881352 0.5916957 0.2327694 -0.1580858 -0.0795157 -0.1270293 0.0268555 -0.1444408 0.0782373 0.0083985 0.0415544 -0.0319308 0.0463764 0.0182098 0.0545391 -0.1272861 -0.144956 -0.0644988 -0.0352602 -0.1641908 -0.0293651 0.045658 0.0234425 -0.012909 -0.1058266 1.1213723 -0.0549065 0.0693876 -0.3281747 0.3486729 -0.047355 0.2272201 -0.0153512 0.6953192 -0.0239103 -0.0671746 -0.0493104 -0.0869677 0.0358461 0.0918594 -0.0798154 0.0906675 -0.0949492 -0.0049182 0.0979194 0.0040369 0.1023991 0.1078796 0.0795607 0.0184052 0.0583416 -0.1105727 0.0546478 0.03992 -0.0442684 0.0408599 -0.0706439 0.0151814 -0.01575 0.0195361 -0.139012 0.0755446 0.0478714 -0.0087048 0.0416674 0.099175 0.0300821 -0.0166697 0.0203408 0.1743507 0.0556257 -0.0983439 -0.0133673 -0.0860363 -0.0001511 -0.0608858 -0.0288512 -0.0462339 0.135908 0.1098936 0.055516 0.0511092 0.0530968 0.0537022 -0.0465431 0.0602261 -0.0186 0.1283026 0.0097041 -0.0165265 -0.0574815 0.1028006 -0.0200081 -0.1265216 -0.041578 -0.0593874 -0.0772686 0.0526491 -0.0283066 0.0164721 -0.085616 0.0212725 0.0860573 0.0033711 0.0309554 0.0662367 0.0136206 0.0692044 0.0517998 0.0830697 -0.0057321 -0.0818674 0.0611428 -0.0784443 0.1150116 0.0368291 -0.0594047 -0.0086489 -0.0874807 -0.0422212 -0.0658828 -0.0194768 -0.059683 0.1323757 -0.1124075 -0.0302478 0.0397538 -0.0333904 0.0982946 -0.0207233 0.0424437 -0.0153465 0.1497017 0.5369592 -0.183906 0.0766871 -0.044799 0.1770733 0.0556072 0.0850281 -0.0044409 0.2947332 unknown
polarizability: 189.6161401|-1.7262139|142.1930075|-7.3863444|-5.2801178|73.8545502 unknown
InChI: InChI=1S/C9H9N3OS/c13-7-12-9(14)11(6-10-12)8-4-2-1-3-5-8/h1-6,13H,7H2
charge 0 multiplicity 1
23 atoms
S  -1.321412 2.098275 -0.499604
O  -4.194906 0.510551 -1.035021
N  -0.229165 -0.414845 0.304413
N  -2.417431 -0.277064 0.416474
N  -2.108338 -1.595016 0.808942
C  1.172588 -0.177811 0.082201
C  -1.303262 0.484785 0.082113
C  -0.776362 -1.634353 0.730218
C  1.956168 -1.207209 -0.493976
C  1.757882 1.056084 0.449134
C  -3.80999 0.205913 0.318689
C  3.339036 -1.00395 -0.686311
C  3.140022 1.250859 0.239387
C  3.935213 0.225303 -0.321754
H  -0.179665 -2.498438 1.005367
H  1.487664 -2.144126 -0.814455
H  1.139042 1.847323 0.879267
H  -3.891589 1.092717 0.977914
H  -4.452205 -0.614506 0.665529
H  3.944656 -1.798806 -1.134075
H  3.59499 2.20647 0.519983
H  5.007138 0.38411 -0.479312
H  -3.661575 1.304537 -1.32622
