program: Gaussian 09
title: 000200657
version: EM64L-G09RevD.01
frameworkgroup: C1[X(C12H21NO2Si)]
method: RPBEPBE
basis: SDD
operation: Freq
keyword: #p
keyword: freq=noraman
keyword: PBEPBE/SDD
title: #p freq=noraman PBEPBE/SDD
converged: YES YES NO NO
title: Mulliken charges:
elementType: Si O O N C C C C C C C C C C C C H H H H H H H H H H H H H H H H H H H H H
charge: 0.663337 -0.240186 -0.311750 -0.435527 -0.326749 -0.757578 0.451504 -0.225373 -0.207963 -0.367052 -0.415447 -0.677993 -0.681583 -0.218679 -0.198471 -0.277395 -0.051653 -0.059034 0.236151 0.242406 0.236955 0.346956 0.222231 0.204465 0.224847 0.200898 0.235944 0.206198 0.207901 0.230436 0.224194 0.214493 0.221747 0.230435 0.214441 0.215471 0.221421
chargesum: 0.00000
title: Mulliken charges with hydrogens summed into heavy atoms:
elementType: Si O O N C C C C C C C C C C C C
charge: 0.552649 -0.240186 -0.311750 -0.088571 -0.090598 -0.278217 0.451504 0.201323 0.217782 -0.131108 -0.209248 -0.015462 -0.014908 -0.004238 0.017000 -0.055973
polarizability: 2.39541857e+02 1.07859760e+01 1.74672465e+02 5.70435069e+00 -7.92334754e+00 1.09976541e+02
1716.lowfreq: -1.4515 -0.0018 -0.0010 -0.0009 6.2029 8.7399 18.5845 37.0100 37.7375
frequency: 15.4185 36.9636 37.7182 49.1895 62.8405 73.1852 81.7285 104.0360 129.6849 144.2518 162.3137 171.9006 226.1798 231.1508 238.5763 249.1915 297.4086 318.1468 342.2574 392.5432 410.6792 423.1772 506.3783 513.9522 565.1999 592.7381 606.5046 614.4631 646.3700 682.9921 693.1430 753.9098 755.4912 775.7913 799.5868 808.7812 812.2569 818.8456 827.4150 838.0956 864.7626 889.0863 893.2181 911.2092 951.8844 970.4561 975.9004 998.1663 1021.4588 1028.3905 1048.2873 1076.6973 1110.8314 1112.4181 1117.2315 1134.0964 1137.0391 1167.3196 1183.7327 1199.2107 1242.3824 1246.2179 1251.8883 1257.2103 1311.4096 1323.0694 1333.9691 1362.4116 1365.5511 1383.2490 1396.2049 1396.4505 1438.7642 1460.0034 1461.9463 1469.9123 1476.2367 1479.4773 1489.6724 1491.5555 1495.5012 1526.0732 1592.4901 1624.9098 2128.9787 2146.7002 2906.8813 2953.0261 2960.2752 2960.4022 2967.8626 2991.3926 2993.5883 3023.4378 3035.7677 3087.5947 3091.1068 3098.4029 3100.7773 3105.9672 3120.1011 3132.6920 3149.5058 3164.0432 3461.3220
redmass: 4.0507 3.9227 3.0113 2.7832 2.4168 4.2326 1.9656 3.6187 3.3587 3.2686 2.6485 2.7378 3.7752 1.9633 1.7967 1.3618 3.5262 3.4400 3.4428 3.1818 2.9285 3.7578 2.6179 1.9491 3.3208 1.6455 1.4926 5.3976 2.0517 1.7603 1.8580 1.9246 2.5550 2.0647 2.4161 1.1602 1.3397 1.1677 2.5500 2.7237 1.5272 1.4157 1.3535 3.1121 1.3605 1.2966 5.6843 2.8907 2.2355 2.7172 4.5903 1.8178 2.1141 2.1525 3.3719 1.4326 1.4755 1.0477 1.1125 1.0873 1.2314 1.1774 1.3179 1.1627 1.4279 1.1647 2.1404 1.3057 1.2742 4.2062 1.2603 1.2652 2.4187 1.0408 1.0440 1.1800 1.0526 1.0476 1.0881 1.0865 2.1729 1.6564 3.6557 6.2682 1.0308 1.0508 1.0626 1.0597 1.0640 1.0904 1.0827 1.0362 1.0360 1.1026 1.1012 1.0990 1.0990 1.1010 1.1012 1.0863 1.0858 1.0931 1.0932 1.1006 1.0796
irintensity: 0.1226 0.1269 0.0154 0.2296 0.2701 1.1104 1.9064 1.9550 2.2398 0.0892 1.6984 14.2672 0.1461 0.5697 1.4367 6.3409 1.0113 2.1581 13.9617 8.1461 0.0962 3.7985 14.0164 16.2885 12.7469 24.7568 34.6994 2.9137 6.4932 27.6948 58.2575 82.6947 11.6162 141.9541 7.3255 3.3087 2.8376 3.6011 39.3101 7.6528 29.3313 20.0565 68.1922 281.5004 0.4833 0.5425 6.1982 22.6455 7.3036 93.6575 129.8536 7.3800 7.2249 8.5634 8.4507 6.8226 6.0596 1.1774 9.8508 8.1264 10.3640 2.2054 10.4181 1.5065 0.4004 3.2730 53.8505 4.6628 4.1082 33.4929 25.0973 22.3728 2.4137 11.1284 8.2741 41.1008 5.9916 5.0795 11.9726 2.1318 61.8071 198.2694 16.5147 228.4401 96.8167 79.3277 65.6688 44.6444 54.3696 13.3426 41.5900 20.0677 25.6416 21.9630 23.1958 46.6797 31.9745 39.7783 37.8522 19.0985 4.6915 36.7228 41.1153 17.2664 293.4875
temp: 298.150 k
press: 1.00000 atm
elementType: 14 8 8 7 6 6 6 6 6 6 6 6 6 6 6 6 1 1 1 1 1 1 1 1 1 1 1 1 1 1 1 1 1 1 1 1 1
symmnumber: 1
zpe: 801846.3 jmol-1
zpe.correction: 0.305407 hartree
zpe.thermalcorrener: 0.324519 hartree
zpe.thermalcorrenthalpy: 0.325464 hartree
zpe.thermalcorrgfe: 0.255490 hartree
zpe.sumelectzpe: -963.163822 hartree
zpe.sumelectthermal: -963.144710 hartree
zpe.sumelectthermalent: -963.143766 hartree
zpe.sumelectthermalfe: -963.213739 hartree
dipole: -3.1135 0.5233 0.1302
dipole: 3.1599
quadrupole: -108.2833 -95.6460 -109.6881
quadrupole: -2.5023 5.5449 -0.5180
quadrupole: -3.7442 8.8931 -5.1489 -2.5023 5.5449 -0.5180
hfenergy: -963.4692294 hartree
pointgroup: C01 [X(C12H21N1O2Si1)]
dipole: 1.2344703 -0.1468756 0.0068257 debye
polarizability: 237.7315072|14.0035327|175.9930151|-10.9749026|6.4500143|110.4663411 unknown
InChI: InChI=1S/C12H21NO2Si/c1-3-14-12(15-4-2)16-10-13-11-8-6-5-7-9-11/h5-9,12-13H,3-4,10,16H2,1-2H3
charge 0 multiplicity 1
37 atoms
Si 1.44774 2.026606 -0.279925
O  3.821107 0.522151 0.543548
O  1.783789 -0.666309 -0.064549
N  -0.937938 0.551349 -0.134026
C  2.369313 0.533327 0.571683
C  -0.423386 1.88919 0.155155
C  -2.288185 0.207384 -0.038053
C  4.428608 0.679633 -0.80034
C  2.096655 -1.930542 0.658327
C  -3.290392 1.154643 0.329461
C  -2.693867 -1.135129 -0.317582
C  5.921614 0.39467 -0.652866
C  1.466386 -3.079612 -0.125008
C  -4.644819 0.763652 0.408939
C  -4.047297 -1.509338 -0.230404
C  -5.040132 -0.56504 0.133128
H  1.639939 1.976812 -1.772139
H  1.995571 3.321716 0.262863
H  2.144576 0.518372 1.659846
H  -0.959837 2.65587 -0.445194
H  -0.571564 2.175213 1.222398
H  -0.249793 -0.195463 -0.277982
H  3.944233 -0.022749 -1.506549
H  4.257373 1.716544 -1.159268
H  3.195916 -2.034321 0.726459
H  1.684146 -1.862646 1.687386
H  -3.012573 2.188666 0.557109
H  -1.936556 -1.873814 -0.61182
H  6.434155 0.522581 -1.623809
H  6.37825 1.084616 0.077507
H  6.088684 -0.638754 -0.302957
H  1.692619 -4.043559 0.366244
H  0.368424 -2.970765 -0.17678
H  1.862153 -3.112102 -1.1547
H  -5.397962 1.508495 0.693349
H  -4.332136 -2.545192 -0.450906
H  -6.092612 -0.859856 0.198052
