program: Gaussian 09
title: 000200631
version: EM64L-G09RevD.01
frameworkgroup: C1[X(C10H9NO2)]
method: RPBEPBE
basis: SDD
operation: Freq
keyword: #p
keyword: freq=noraman
keyword: PBEPBE/SDD
title: #p freq=noraman PBEPBE/SDD
converged: NO YES NO NO
title: Mulliken charges:
elementType: O O N C C C C C C C C C C H H H H H H H H H
charge: -0.278815 -0.454304 -0.402474 0.163894 0.231190 0.211391 -0.355983 -0.379823 -0.348620 0.050161 -0.238953 -0.208330 -0.353880 0.272548 0.318056 0.286715 0.233487 0.228466 0.227483 0.216345 0.216420 0.365024
chargesum: 0.00000
title: Mulliken charges with hydrogens summed into heavy atoms:
elementType: O O N C C C C C C C C C C
charge: -0.278815 -0.089279 -0.084418 0.163894 0.231190 0.211391 -0.083435 -0.093108 -0.115133 0.050161 -0.010487 0.019152 0.078885
polarizability: 1.78564232e+02 4.10944477e+00 1.35782607e+02 6.48158787e-02 -1.26310533e-02 5.18523182e+01
1716.lowfreq: -12.0724 -4.6762 -0.0005 -0.0005 0.0006 4.8335 57.0346 67.2137 107.8553
frequency: 57.0268 67.0921 107.8547 129.8299 220.3434 254.7827 279.8451 331.9883 395.5525 424.6136 467.3251 494.0120 544.7403 569.8032 572.5284 594.5887 625.7844 649.8609 755.4325 759.5502 766.2548 771.7700 823.1965 865.4441 868.1593 909.5545 950.1979 991.8614 1000.6277 1009.4178 1035.3372 1093.7324 1137.5320 1150.7225 1168.9492 1180.7053 1238.1765 1247.7998 1255.9007 1300.2073 1359.8741 1383.8764 1397.8978 1428.8145 1449.1951 1460.4454 1486.1266 1520.8436 1576.9422 1592.5391 1632.6236 2953.7414 2993.5002 3131.6153 3144.0350 3162.3379 3183.5833 3225.8583 3367.3993 3598.4048
redmass: 4.1744 3.6139 6.0507 4.7864 4.0328 6.1550 4.4790 5.6092 6.8729 2.9088 1.3261 5.1594 2.0602 6.6026 3.5468 1.2359 6.6629 2.6639 5.5033 1.3041 5.4915 4.2695 1.4175 5.1126 1.4225 6.5729 1.3697 1.3127 2.0642 2.0929 5.3940 2.0610 1.5103 1.7074 1.1980 1.0758 1.4579 1.6501 2.1374 2.3714 2.4145 1.4594 5.4585 2.4040 3.5113 1.1078 3.1081 4.7993 6.4951 6.6459 7.0779 1.0564 1.1039 1.0860 1.0913 1.0973 1.0970 1.0982 1.0637 1.0811
irintensity: 1.5140 4.7942 0.8671 2.7275 9.8739 8.9554 5.3461 35.4802 1.9432 15.2233 77.3459 5.8402 19.0393 1.2008 4.5247 122.9745 1.5141 2.7539 7.8571 121.1187 6.8620 2.2358 10.9670 0.7440 0.8405 165.4942 4.2735 0.5881 0.5098 12.9403 98.6228 13.9805 35.9754 8.5437 7.9121 4.8835 17.9817 64.3478 22.3264 17.9007 5.0466 283.8919 37.2393 29.3368 24.6195 7.5845 0.0083 31.0562 210.8985 13.4691 3.3516 46.5765 32.9532 0.3280 17.7245 23.5402 6.7195 0.2285 48.9481 78.0603
temp: 298.150 k
press: 1.00000 atm
elementType: 8 8 7 6 6 6 6 6 6 6 6 6 6 1 1 1 1 1 1 1 1 1
symmnumber: 1
zpe: 443322.6 jmol-1
zpe.correction: 0.168853 hartree
zpe.thermalcorrener: 0.179620 hartree
zpe.thermalcorrenthalpy: 0.180564 hartree
zpe.thermalcorrgfe: 0.131746 hartree
zpe.sumelectzpe: -590.746059 hartree
zpe.sumelectthermal: -590.735291 hartree
zpe.sumelectthermalent: -590.734347 hartree
zpe.sumelectthermalfe: -590.783166 hartree
dipole: -4.8314 4.9555 0.0117
dipole: 6.9209
quadrupole: -86.1422 -60.3197 -79.4245
quadrupole: 1.6642 0.0761 -0.0231
quadrupole: -10.8468 14.9758 -4.1290 1.6642 0.0761 -0.0231
hfenergy: -590.9149118 hartree
pointgroup: C01 [X(C10H9N1O2)]
dipole: 1.8847574 -1.9624034 0.104087 debye
dipolederiv: -0.7975499 0.0761913 -0.0142126 0.5432169 -0.9175624 0.0289298 -0.0274373 0.01896 -0.32661 -0.7696094 0.2400291 -0.0116549 0.1883949 -0.3946801 0.0021892 -0.0108021 0.0031275 -0.5482511 -0.8228727 0.4265847 -0.0253463 0.0126402 -0.4355784 0.0050473 -0.0144223 0.0152913 -0.2572024 0.292988 0.1311271 0.0035451 0.1690864 -0.1463373 0.0086672 0.0023538 0.0075757 0.022603 0.081055 0.092522 -0.0010441 0.5007577 0.202324 0.0081157 -0.0111275 -0.0022233 0.0266829 -0.8259382 0.2779077 -0.0263134 0.6295931 -0.3908312 0.0239223 -0.0344494 0.0146447 -0.0860554 0.4425827 -0.5782567 0.0282703 -0.7325485 0.3239372 -0.029105 0.032646 -0.0253818 -0.0998145 -0.0606484 -0.0267053 0.0023399 -0.0701429 0.0708511 -0.0069375 0.0036711 -0.0059239 -0.1349254 0.0411238 -0.0384877 0.0064129 -0.0765156 0.0143397 -0.0068764 0.0073812 -0.0058819 -0.1833238 1.5533886 -0.2203807 0.0427807 -0.584494 0.9351224 -0.0364401 0.0531939 -0.027828 0.1114207 -0.0714499 -0.0005593 0.002484 0.0323058 0.1368438 -0.0070367 0.0015105 -0.0078988 -0.1713743 0.0686364 -0.002363 0.0057414 -0.0492013 -0.0584172 -0.0038566 0.0069894 -0.0027251 -0.1656371 0.0787058 -0.3153083 0.0001389 -0.590975 0.2504826 -0.0127231 0.0059875 -0.0053749 0.4026655 0.0542787 -0.0577482 -0.0018704 -0.0681949 0.0537472 0.0016425 -0.0015314 0.0018716 0.1868991 0.1557673 0.0030513 -0.0045897 -0.0463725 0.2434759 0.0011825 -0.0034626 0.0024183 0.3387637 0.0776155 0.0807555 -0.0040821 0.0353698 0.048002 0.003728 -0.0028938 0.0049674 0.1630962 0.0106608 0.0705766 -0.0058683 0.1129559 -0.041467 0.0082732 -0.0069516 0.0072175 0.1778272 0.0476674 -0.0727895 -0.0009825 -0.0851527 -0.0938215 0.0043417 -0.0006396 0.0046969 0.1619824 -0.1302125 -0.0359029 -0.0062589 -0.0409534 0.0853109 0.0009294 -0.0061054 0.0010632 0.1625141 0.0111656 0.0551217 -0.0306464 0.0531176 -0.0288445 0.0966458 -0.0377224 0.1270166 -0.0720052 0.0071198 0.0643515 0.0318501 0.060906 -0.041036 -0.0946413 0.039043 -0.124789 -0.0548389 0.5555255 -0.1697169 0.0093063 0.0062066 0.1841389 0.0040021 0.0047689 -0.0008242 0.3455833 unknown
polarizability: 178.5452513|3.8545282|135.6702422|3.0977958|-2.0637041|51.9836631 unknown
InChI: InChI=1S/C10H9NO2/c12-6-10(13)8-5-11-9-4-2-1-3-7(8)9/h1-5,11-12H,6H2
charge 0 multiplicity 1
22 atoms
O  -2.074086 1.570945 -0.13635
O  -4.449289 0.410565 -0.170659
N  0.793938 -2.112833 0.033909
C  0.611332 0.167836 -0.027904
C  1.545987 -0.919684 0.022243
C  -0.727223 -0.417177 -0.045953
C  -0.55846 -1.815324 -0.006813
C  1.09865 1.49906 -0.04946
C  2.942903 -0.726478 0.051449
C  -1.995622 0.296187 -0.096424
C  2.493284 1.701918 -0.020465
C  3.40384 0.606117 0.029246
C  -3.322634 -0.492936 -0.112604
H  -1.307987 -2.605043 -0.005481
H  1.187291 -3.051859 0.067028
H  0.39575 2.334978 -0.087758
H  3.644755 -1.56654 0.089618
H  2.890294 2.722697 -0.036502
H  4.481357 0.802231 0.050588
H  -3.387028 -1.117109 0.803115
H  -3.335249 -1.168102 -0.993632
H  -4.055001 1.332854 -0.182191
